nombre;email
UDEA;academica@udea.edu.co
"Universidad de Antioquia";info@udea.ude.co
UTP;info@utp.ude.co
UPB;info@upb.ude.co
UNIAJC;info@uniajc.ude.co
ICESI;info@icesi.ude.co
"Universidad Javeriana";info@ujaveriana.ude.co
Uniminuto;info@uniminuto.ude.co
Uniminuto;info@uniminuto.ude.co
