module zora-minter

go 1.18

require (
	github.com/caarlos0/env/v7 v7.1.0
	github.com/chenzhijie/go-web3 v0.0.0-20230207023847-2f8f24b124a4
	github.com/joho/godotenv v1.5.1
)

require (
	github.com/andybalholm/brotli v1.0.4 // indirect
	github.com/btcsuite/btcd/btcec/v2 v2.2.0 // indirect
	github.com/decred/dcrd/dcrec/secp256k1/v4 v4.0.1 // indirect
	github.com/ethereum/go-ethereum v1.10.26 // indirect
	github.com/gorilla/websocket v1.5.0 // indirect
	github.com/klauspost/compress v1.15.9 // indirect
	github.com/valyala/bytebufferpool v1.0.0 // indirect
	github.com/valyala/fasthttp v1.41.0 // indirect
	golang.org/x/crypto v0.0.0-20220214200702-86341886e292 // indirect
	golang.org/x/sys v0.0.0-20220728004956-3c1f35247d10 // indirect
)
