id,age,gender,Predicted Compliance (Stage 1),Robot’s Permissibility (Stage 1),Own Permissibility (Stage 1),Predicted Compliance (Stage 2),Robot’s Permissibility (Stage 2),Own Permissibility (Stage 2)
1,30,female,5,5,1,6,7,2
2,27,female,7,3,1,7,5,7
3,24,female,7,6,6,7,6,7
4,43,female,4,5,3,4,4,6
5,59,male,1,1,1,1,1,1
6,47,male,5,2,2,5,4,4
7,34,male,4,4,7,4,4,7
8,28,male,7,4,1,7,4,1
9,48,male,4,2,3,5,4,4
10,33,female,4,4,1,4,4,7
11,30,male,4,5,3,5,5,3
12,29,male,4,4,4,5,5,5
13,41,male,6,6,7,7,7,7
14,24,male,4,1,1,6,6,2
15,25,female,2,3,1,5,5,1
16,32,male,2,1,2,1,1,2
17,30,female,4,1,1,4,7,4
18,33,male,7,6,4,6,5,4
19,68,female,7,7,2,7,7,7
20,37,male,3,1,1,7,7,1
21,39,male,4,3,1,6,5,3
22,27,male,7,4,4,7,7,7
23,22,male,4,6,5,5,4,5
24,67,female,4,4,1,7,4,7
25,35,female,6,6,1,6,7,7
26,28,female,4,2,1,5,3,1
27,25,male,1,1,1,7,1,1
28,37,male,2,1,1,4,7,1
29,34,male,7,4,1,7,4,1
30,34,male,4,4,7,7,7,7
31,35,male,2,2,1,6,6,6
32,24,male,3,6,5,6,4,3
33,46,male,5,3,3,6,6,6
34,40,female,3,1,1,6,7,7
35,35,male,7,6,4,7,6,4
36,68,male,2,1,2,3,4,2
37,36,male,1,1,1,1,1,1
38,43,female,1,1,1,1,1,1
39,27,male,5,3,4,4,5,4
40,35,female,3,1,1,4,2,2
41,42,female,1,1,1,4,4,1
42,28,male,2,1,1,5,5,6
43,21,female,6,4,4,6,4,4
44,35,male,5,1,3,6,7,3
45,31,male,4,1,1,3,1,1
46,40,female,6,3,1,6,1,1
47,27,male,5,5,3,5,6,6
