id,Condition,age,gender,experience,q1 self pre,q2 robot pre,q1 self post,q2 robot post,check,Question 1 Gain,Question 2 Gain
af4dc67d2ae355e4334c25c917b6a8c3,1,20,na,3,1,1,1,1,3,0,0
f414837799b0a46843ec241c1cd55d01,1,23,male,4,1,3,1,2,3,0,-1
800018d01903427eea771c49eefe2477,1,24,female,1,2,2,2,2,3,0,0
1415931e4c3a8e64215f9284c9ec6630,1,24,male,1,1,1,1,7,3,0,6
f5620babdf6d09b27af2644d8a9bedf2,1,25,female,3,4,4,3,4,3,-1,0
981515bf8966604f8ed8465eca967e68,1,27,male,2,4,3,3,2,3,-1,-1
94568e72963256423f053d101a1f95d4,1,27,male,3,2,4,2,4,3,0,0
86ee5f9f5c100b72a7d306486b9bf97d,1,28,male,1,5,3,5,2,3,0,-1
80db462a1999b061ff7faa56cb7f7a08,1,28,male,2,1,1,1,1,3,0,0
4668e36714f8272a53d1046dab05a6e4,1,28,male,2,2,2,2,3,3,0,1
e969e15b4d6c0ba25aec0eed0bce2947,1,28,male,3,1,5,2,5,3,1,0
6f4517986c74c0e1abb0c06d558105f4,1,28,male,4,2,2,2,2,3,0,0
b45d8ab5aac0f986a2e80ee224d18ff7,1,31,male,3,4,4,4,4,3,0,0
a2717291dcc5dba26796eadee8bf461d,1,32,male,1,5,5,7,7,3,2,2
618bfb7888d9ae1880803f842ec6c782,1,34,male,2,1,1,1,1,3,0,0
b1ce6672f5b18b07c87de240608252f7,1,35,female,2,1,1,1,1,3,0,0
c9811fdc1bcce33d374408e01706999d,1,35,male,3,4,3,4,3,3,0,0
0733c4835f19644a184bf29dd7d9b113,1,36,female,1,1,1,1,1,3,0,0
ad59f2d1f13885fcd89a05814b5b85c0,1,39,male,1,1,1,1,1,3,0,0
ed44760a7384d7692a49f5617670139d,1,39,male,1,1,1,1,1,3,0,0
e0bb14c4e7145c1cbf9251d4050cc84e,1,40,female,1,1,1,1,1,3,0,0
a62d9d01f4ca3ce8f390c771333e1b74,1,41,female,1,1,1,1,1,3,0,0
a7a47a43b6c16027b8c82173523591c1,1,47,male,4,5,7,5,7,3,0,0
8f4a0ef5e58ef23202eb767403f50a63,1,49,male,2,1,4,1,4,3,0,0
d38aaffa9d918ac582904519477ea0f8,1,53,female,1,1,7,1,7,3,0,0
9a35b13ebc963a621c7dc8891df7a97c,1,54,female,1,1,1,1,1,3,0,0
1bc83be569eac27348a579ad1aea3813,1,59,female,1,1,7,1,7,3,0,0
796d339eb21639ad81545a91cbb98151,1,60,female,1,1,3,1,3,3,0,0
766b7bf61092482840a0fe6bc7a55e56,1,61,male,4,1,1,1,1,3,0,0
4eea4e43f6b4dce67eef760a70950f06,2,22,male,1,5,4,6,6,3,1,2
dd4d017cba9611609a9070586db92193,2,23,female,1,5,5,4,4,3,-1,-1
2fa636c458caff237dcc102fd139b42e,2,23,male,3,4,4,3,5,3,-1,1
daf5ef3ec6e40ec332551f3c672929c2,2,26,female,2,1,4,7,4,3,6,0
ea0a504fa8a562b01ae30bf114bfafdf,2,26,male,3,5,5,5,5,3,0,0
47005ff644fdbbfa500effaa49be794d,2,27,female,6,4,7,4,5,3,0,-2
81fa023920cbe3ecbe52c1bd4257044a,2,28,male,1,1,1,1,7,3,0,6
cfd5dbdc27f8afd06a06ea9179a1cad1,2,28,female,3,1,4,6,7,3,5,3
c26714b48df241ee3c59054144e9cb2a,2,29,male,2,1,1,7,7,3,6,6
1da7704f0967b0eda5be0f88430faa3b,2,29,male,3,3,4,5,5,3,2,1
f6b2c610d28b92b95c5d5e581d3a1614,2,29,male,3,1,1,1,6,3,0,5
0f82d2ed3a192735155b13926bb6e14a,2,30,male,1,1,1,3,4,3,2,3
7b709c97428b9d360b59263cfb043515,2,31,male,1,1,1,7,6,3,6,5
80d2603ef1ac347b3b7e4a049f72d35a,2,32,male,3,2,1,2,5,3,0,4
d7f45bd8bed76f0ad466f546d0898397,2,32,female,4,4,3,3,3,3,-1,0
4db88b9718c50e47a5c00fe9675b70c4,2,33,female,1,1,4,7,5,3,6,1
b208ffcfb86962acd8e79bae4faf96e0,2,35,male,3,2,4,2,6,3,0,2
598eb92d0f6848722a3167e63f226072,2,36,female,1,1,1,7,7,3,6,6
4ea6ecd08f9217ad69150e28ef8e183a,2,36,male,1,1,1,7,7,3,6,6
872e07f7c8dcb9567bc962a7a4f5d6d8,2,36,male,2,1,1,5,6,3,4,5
405b458fd92eae58ae80127f21146bbd,2,38,male,1,1,1,4,6,3,3,5
c146c655a1509d448cf9a2c440bb4086,2,38,male,2,1,2,1,2,3,0,0
5bab5d1606b15b5e406a6b6ff3c4e33b,2,38,male,2,2,2,6,6,3,4,4
d9f118a479a63c54bf5f56c754e595df,2,42,female,2,3,3,4,4,3,1,1
736a76a0087cd767dada69b6dec16bf1,2,42,male,3,1,1,1,7,3,0,6
3b097a56224aa011d8beef80cec58410,2,51,male,1,4,4,4,4,3,0,0
31b25001698dfb4ff94a9d56b6aeb82e,2,54,male,1,5,5,6,6,3,1,1
1fdd80d6b702a57806f18de99e245b51,2,58,female,1,4,6,7,7,3,3,1
5ddc382807b2f637a136b260505d9242,2,59,male,1,5,7,7,7,3,2,0