id,condition,age,gender,experience,pretest_1,pretest_2,pretest_3,pretest_4,pretest_5,Direct_pre,Poilte_pre,q1_1,q1_2,q1_3,q1_4,q1_5,q1_6,q1_7,q1_8,q1_9,q1_10,q2_1,q2_2,q2_3,q2_4,q2_5,q2_6,q2_7,q2_8,q2_9,q2_10,q3_1,q3_2,q3_3,q3_4,q3_5,q3_6,q3_7,q3_8,q3_9,q3_10,q4_1,q4_2,q4_3,q4_4,q4_5,q4_6,q4_7,q4_8,q4_9,q4_10,lastqs_1,lastqs_2,check,Like_pre,Like1,Like2,Like3,Like4,Like_gain1,Like_gain2,Like_gain3,Like_gain4,Dir_gain1,Dir_gain2,Dir_gain3,Dir_gain4,Pol_gain1,Pol_gain2,Pol_gain3,Pol_gain4
edf8f640db0a573e1cc72268b0c709d2,2,21,female,2,59,48,60,51,61,66,66,59,53,64,53,66,58,49,66,53,65,66,59,71,59,71,69,58,73,64,74,68,53,64,52,67,51,61,52,64,54,68,54,68,58,65,62,52,67,61,67,63,67,3,55.8,59,65.2,60.8,62.6,3.2,9.4,5,6.8,-13,-2,-2,-5,-1,8,-12,1
b4c7a5eb2fe77f04364e2a0b3c4ca1a7,0,22,female,2,72,64,80,58,71,72,62,83,63,67,61,71,81,67,80,72,80,84,56,69,70,83,58,75,64,84,72,86,47,62,72,70,81,72,73,63,79,84,61,75,75,62,77,62,79,72,81,73,60,3,69,69,72.4,67.4,71.4,0,3.4,-1.6,2.4,0,12,-9,0,18,10,17,19
bf63096714f0c3aa7c8020a6471222f9,3,22,male,2,54,71,88,73,82,76,83,35,52,27,43,42,35,68,33,73,28,63,75,59,64,73,35,36,41,52,49,74,75,93,67,87,47,42,32,23,41,95,84,83,93,100,71,48,21,48,48,58,45,3,73.6,39.8,66.8,79.2,91,-33.8,-6.8,5.6,17.4,-3,-24,-53,-28,-55,-34,-42,-35
74738ee0a5a250cc84b8336505ca4bd3,2,22,male,2,59,44,71,83,84,82,61,75,65,82,71,83,84,59,64,80,56,74,49,64,45,65,53,54,84,96,80,98,93,81,96,88,65,52,51,68,50,74,53,38,69,74,77,86,63,63,79,49,32,3,68.2,75.2,59.4,91.2,61.6,7,-8.8,23,-6.6,-2,14,-14,-19,-5,19,-11,18
7928d60173cbd1626d40bf432376a772,1,22,male,5,87,85,87,93,96,50,53,93,94,93,92,90,22,48,65,34,65,81,82,86,82,76,35,50,70,58,50,93,92,91,90,90,83,2,5,16,63,98,87,88,87,94,91,15,3,51,51,51,10,3,89.6,92.4,81.4,91.2,90.8,2.8,-8.2,1.6,1.2,-16,8,-34,1,12,-3,10,-2
c8014d42bd9709a54b69c84268269c30,0,23,female,1,100,100,100,100,100,51,50,100,100,100,100,100,33,50,34,50,50,97,89,91,89,90,34,67,36,67,35,100,100,100,100,100,81,43,0,43,58,100,100,100,100,100,82,50,0,50,50,34,33,3,100,100,91.2,100,100,0,-8.8,0,0,-1,16,-8,-1,0,-15,8,0
f9a385e4da1ae34654fe5490df6cb496,3,23,male,2,75,74,74,96,93,50,68,100,99,97,98,97,15,51,66,50,50,97,65,65,79,91,29,50,66,50,50,54,83,100,74,87,89,0,8,19,100,99,99,99,98,98,89,36,7,42,88,71,8,3,82.4,98.2,79.4,79.6,98.6,15.8,-3,-2.8,16.2,0,0,-31,-8,-18,-18,32,20
1b1e4f401faa09c12d39020eba5926be,2,23,male,5,96,75,74,74,73,50,50,52,62,65,65,61,76,70,69,81,73,75,73,51,49,73,67,66,50,49,51,75,73,83,74,74,48,49,65,69,67,74,74,50,51,51,66,66,49,49,67,67,66,3,78.4,61,64.2,75.8,60,-17.4,-14.2,-2.6,-18.4,31,-1,19,-1,23,1,17,17
b9482e5f63aeec2626a8dffc046352e2,1,26,female,3,71,71,73,72,73,53,53,72,77,75,73,75,52,52,52,50,47,74,75,74,75,74,78,81,79,51,47,75,73,73,75,73,50,76,54,78,57,75,75,75,73,75,72,55,67,49,49,73,72,3,72,74.4,74.4,73.8,74.6,2.4,2.4,1.8,2.6,-3,-2,25,-4,-6,-6,4,-4
dea42ea708131f9c50fdc7e30f8247ca,0,26,female,2,50,76,98,75,99,50,82,98,74,74,99,74,20,34,67,36,84,76,99,99,75,99,18,35,67,36,100,51,75,76,75,75,99,16,0,18,99,75,99,98,75,99,99,18,1,17,100,51,18,3,79.6,83.8,89.6,70.4,89.2,4.2,10,-9.2,9.6,-14,-14,-32,-33,2,18,17,18
09d90107a7c5d821ba6c134323a5cabb,1,26,female,3,68,60,71,65,56,64,74,38,37,46,42,44,40,42,50,60,53,59,69,57,61,62,63,72,64,76,65,36,33,45,45,46,47,45,54,55,60,36,41,49,51,51,51,60,48,56,56,75,71,3,64,41.4,61.6,41,45.6,-22.6,-2.4,-23,-18.4,-4,12,-9,-8,-21,-9,-14,-18
582ee985f380583a9b3629ae612585fd,2,26,male,3,73,74,75,76,74,45,49,74,75,73,79,75,50,49,51,50,49,77,75,74,74,73,72,51,53,79,48,74,73,75,76,76,76,50,53,51,52,77,75,74,71,76,72,53,52,78,54,69,67,3,74.4,75.2,74.6,74.8,74.6,0.8,0.2,0.4,0.2,5,34,6,33,0,-1,3,5
6faaa57e4348b3dc18decfe344c08eb9,2,26,male,4,77,89,88,87,86,45,54,55,62,68,69,66,11,49,61,67,64,75,83,77,76,79,4,60,52,50,50,76,83,83,81,88,89,37,10,64,52,83,81,82,82,77,97,43,20,55,55,99,71,3,85.4,64,78,82.2,81,-21.4,-7.4,-3.2,-4.4,22,5,19,10,10,-4,-2,1
1830914fdef73931bd932ed9b246a9fa,2,26,male,4,68,80,83,71,87,52,52,69,85,81,63,73,71,54,52,59,53,73,89,93,93,82,61,67,55,51,58,81,90,89,80,74,50,71,57,50,51,72,92,97,91,95,58,50,50,49,55,69,83,3,77.8,74.2,86,82.8,89.4,-3.6,8.2,5,11.6,7,-1,-2,-3,1,6,-1,3
6331a6004fac9ea8cb7b90f03d1a3cbc,3,27,female,7,97,94,84,95,95,97,86,89,97,84,92,96,87,93,93,74,87,86,99,75,97,79,82,67,86,83,71,97,93,80,91,98,91,53,97,81,97,96,97,98,97,97,81,20,92,93,96,82,81,3,93,91.6,87.2,91.8,97,-1.4,-5.8,-1.2,4,-23,-14,-16,-4,1,-15,11,10
85a1a3b4962b592333f2c5a15539586f,0,27,male,3,96,94,89,97,96,97,97,91,92,95,96,94,93,82,91,86,88,89,85,95,94,88,81,93,85,94,75,81,62,79,73,78,79,72,84,70,87,82,82,63,79,83,85,61,75,74,78,78,93,3,94.4,93.6,90.2,74.6,77.8,-0.8,-4.2,-19.8,-16.6,-11,-3,-27,-23,-9,-22,-10,-19
d5ff7458d1b84fd8b69e5dbcff42dc65,0,27,male,3,100,98,97,97,96,52,51,99,98,97,98,97,17,50,22,49,49,96,94,93,95,99,17,49,0,51,48,98,98,97,95,100,85,34,2,19,98,98,99,98,96,100,100,52,0,51,50,100,80,3,97.6,97.8,95.4,97.6,98.2,0.2,-2.2,0,0.6,-3,-1,-33,-1,-2,-3,47,-1
9de1685bd5d1ecff93a08a973ab5768e,1,28,female,5,71,77,47,77,47,71,71,54,48,50,56,51,53,50,49,51,51,28,45,41,27,30,34,37,34,26,43,61,53,51,55,55,50,52,53,54,51,24,41,34,38,34,23,21,15,46,44,46,45,3,63.8,51.8,34.2,55,34.2,-12,-29.6,-8.8,-29.6,-20,-45,-17,-25,-20,-28,-20,-27
f332cafac5b17a770bd5c752541fe8e5,1,28,female,3,89,89,89,94,90,93,91,89,95,97,93,94,86,89,92,82,67,91,95,94,94,95,53,67,65,73,80,91,93,81,92,92,88,69,78,68,81,86,91,95,92,89,96,93,94,92,93,86,92,3,90.2,93.6,93.8,89.8,90.6,3.4,3.6,-0.4,0.4,-11,-20,-25,-1,-24,-11,-10,2
39ecde2965b471d82cea419c43ec51cd,1,28,male,3,81,87,91,84,87,90,84,85,90,84,88,80,90,84,87,79,87,83,85,87,81,88,82,82,89,78,89,82,90,82,86,81,83,81,85,77,90,85,90,85,87,84,78,85,79,84,87,84,82,3,86,85.4,84.8,84.2,86.2,-0.6,-1.2,-1.8,0.2,-11,-12,-13,-6,3,5,6,3
55609f6a75b923d884f0ef1106f6b287,2,28,male,5,62,78,89,80,84,79,85,89,78,87,70,87,86,75,88,80,90,82,69,83,66,89,71,83,75,79,91,70,83,87,68,88,85,73,89,93,71,77,87,73,86,72,69,85,75,76,83,71,76,3,78.6,82.2,77.8,79.2,79,3.6,-0.8,0.6,0.4,1,0,14,-3,5,6,-14,-2
7a471a403480bcb595a708c07b8c0030,1,29,female,2,100,100,100,100,100,50,50,99,100,100,100,100,51,34,26,23,49,100,100,100,100,100,51,50,34,50,51,99,98,98,97,97,92,28,13,19,50,100,98,100,100,100,82,50,0,51,50,76,50,3,100,99.8,100,97.8,99.6,-0.2,0,-2.2,-0.4,-27,0,-31,1,-1,1,0,0
41232469dec078633e9f7d6f1be13ee8,2,29,male,1,99,99,97,99,99,51,50,74,75,97,76,75,3,81,84,51,52,50,28,27,52,30,3,79,83,82,24,98,99,98,97,96,97,51,19,51,47,98,97,97,96,98,98,52,3,51,50,50,36,3,98.6,79.4,37.4,97.6,97.2,-19.2,-61.2,-1,-1.4,0,31,0,0,2,-26,-3,0
4f8bd68e34725e2b157e3bec21a3842e,1,30,female,2,43,40,50,75,52,50,50,51,51,51,75,51,19,49,1,50,50,0,0,0,0,0,17,81,1,51,0,51,50,50,50,51,51,50,1,50,50,0,1,1,0,1,66,67,0,50,0,29,1,3,52,55.8,0,50.4,0.6,3.8,-52,-1.6,-51.4,0,1,0,0,0,-50,0,-50
cb90458b66d9f0a5463fca360a78519c,3,30,female,5,63,66,73,75,74,50,51,52,63,72,71,63,16,68,96,55,51,50,61,68,64,62,22,87,98,75,28,73,74,76,74,74,83,50,83,50,50,63,51,74,73,65,83,63,81,66,51,37,19,3,70.2,64.2,61,74.2,65.2,-6,-9.2,4,-5,5,25,0,16,0,-23,-1,0
b2240136363f1f45822c3031edb19d57,2,30,male,4,51,78,76,98,74,50,67,27,73,75,99,77,13,83,99,22,94,2,77,75,77,99,4,97,100,67,69,48,74,73,75,97,83,49,98,34,83,24,74,76,97,77,82,98,99,51,68,100,0,3,75.4,70.2,66,73.4,69.6,-5.2,-9.4,-2,-5.8,-28,17,-16,1,27,2,16,1
b25da1d4bb8ad03841b604dd18dd1cab,0,30,male,1,77,100,86,88,76,76,50,88,76,87,95,88,74,50,28,50,54,100,88,89,86,92,80,50,18,57,57,100,93,91,93,93,100,44,0,34,49,99,99,93,93,96,100,34,0,43,50,100,28,3,85.4,86.8,91,94,96,1.4,5.6,8.6,10.6,-26,-19,-42,-33,4,7,-1,0
2ac1354a9e4a8d3c3d9d9489acb35596,1,31,male,3,63,73,75,75,71,46,49,57,69,45,56,56,29,44,48,65,53,57,74,65,78,70,34,49,45,64,71,46,34,67,75,49,62,20,18,21,80,70,64,61,81,72,69,52,75,66,79,52,39,3,71.4,56.6,68.8,54.2,69.6,-14.8,-2.6,-17.2,-1.8,19,18,-25,20,4,22,31,30
5e01dd253841b4d3ace06c81dcb06893,1,31,male,1,64,76,51,76,76,50,50,76,76,76,75,76,17,50,0,51,50,76,51,51,51,51,17,59,0,51,51,51,75,75,76,76,67,34,0,35,68,75,51,51,51,51,67,51,0,50,50,34,51,3,68.6,75.8,56,70.6,55.8,7.2,-12.6,2,-12.8,1,1,-15,0,0,1,18,0
038f12b85c21691e450809d5941ec97f,2,32,female,1,77,99,76,94,86,66,82,75,51,75,97,75,52,49,66,28,51,96,27,50,74,75,67,67,35,68,64,95,50,75,75,96,100,51,17,50,82,96,51,96,95,100,97,50,3,50,51,8,68,3,86.4,74.6,64.4,78.2,87.6,-11.8,-22,-8.2,1.2,-38,2,-16,-16,-31,-18,0,-31
dd7ce3868f7074b0f89077fe4b38d809,0,32,male,5,83,75,75,74,76,81,83,63,84,81,83,87,22,18,13,79,77,78,80,80,76,79,90,31,48,68,68,55,69,54,71,66,41,30,8,70,66,72,66,55,66,60,14,14,20,64,59,83,1,3,76.6,79.6,78.6,63,63.8,3,2,-13.6,-12.8,-2,-13,-11,-17,-6,-15,-17,-24
be24244ce58b7caf389b433381fc0ce9,3,32,male,2,76,100,74,100,100,50,67,74,100,74,100,76,35,50,51,52,68,74,100,74,100,74,33,50,50,50,67,74,100,75,100,74,100,0,0,0,100,74,100,74,100,74,100,50,0,50,83,34,50,3,90,84.8,84.4,84.6,84.4,-5.2,-5.6,-5.4,-5.6,2,0,-50,0,1,0,33,16
6bc3706a5a1d469764c9117349ea56ee,2,33,female,1,96,97,91,93,93,55,56,81,90,91,91,93,25,50,62,49,51,97,97,96,98,98,33,50,20,50,50,98,94,82,87,96,95,48,12,51,51,98,99,97,93,91,91,51,13,50,50,70,23,3,94,89.2,97.2,91.4,95.6,-4.8,3.2,-2.6,1.6,-6,-5,-4,-5,-5,-6,-5,-6
b2f044003851b9ee0cc22e6a6a5f249a,2,33,male,2,52,50,50,51,50,52,54,52,51,51,50,50,48,51,68,67,66,29,28,27,27,52,51,49,49,98,0,51,50,50,51,49,67,67,50,68,68,51,50,51,51,51,69,68,53,84,33,51,67,3,50.6,50.8,32.6,50.2,50.8,0.2,-18,-0.4,0.2,15,46,16,32,12,-54,14,-21
3c37f8fdb0e955cc68f228ff9976b57e,2,33,male,1,100,99,99,98,98,50,49,73,74,73,74,73,19,68,98,72,49,27,27,27,27,50,17,97,98,98,35,98,99,99,99,98,99,51,2,49,50,98,100,99,99,99,99,67,1,82,49,50,67,3,98.8,73.4,31.6,98.6,99,-25.4,-67.2,-0.2,0.2,22,48,-1,32,0,-14,1,0
6a4657df87a22ca47de62f5c09acee63,3,33,male,1,3,94,91,6,23,51,75,19,68,74,73,78,48,31,49,45,46,18,74,79,83,76,22,50,72,50,51,26,86,85,70,63,66,31,0,33,88,28,98,98,52,42,65,49,2,51,50,61,66,3,43.4,62.4,66,66,63.6,19,22.6,22.6,20.2,-6,-1,-18,0,-29,-24,13,-25
7472b7c4b84bd9f253cf4f6be6008a32,2,33,male,1,77,75,75,77,76,53,53,76,75,76,76,76,0,51,82,51,50,80,79,78,77,78,0,68,84,51,50,75,77,76,76,76,100,51,0,51,51,76,75,75,75,79,100,50,0,51,51,84,50,3,76,75.8,78.4,76,76,-0.2,2.4,0,0,-2,-2,-2,-2,-3,-3,-2,-2
305fe197c0598ac39ab686b000b38102,1,33,male,1,75,98,73,74,97,67,51,72,81,80,86,80,24,51,66,51,64,74,51,51,74,50,19,67,66,64,43,71,73,69,74,72,81,46,16,38,66,75,53,61,75,74,66,49,19,51,46,50,66,3,83.4,79.8,60,71.8,67.6,-3.6,-23.4,-11.6,-15.8,-16,-3,-29,-16,13,-8,15,-5
5f9ac970b14ef5043dd823559e2c8a1e,3,37,male,2,70,59,72,73,65,49,50,54,64,63,62,68,51,50,49,59,57,53,58,53,54,56,50,52,52,56,50,66,50,59,58,55,84,50,17,57,56,68,51,51,60,60,83,51,19,51,51,44,54,3,67.8,62.2,54.8,57.6,58,-5.6,-13,-10.2,-9.8,10,7,8,2,7,0,6,1
4c03f1f1aa6e835e552fa4db26be4c29,3,37,male,3,75,75,75,73,74,69,71,77,77,74,79,80,74,83,81,80,81,84,75,79,77,75,68,51,51,68,83,81,80,80,85,86,78,82,77,71,73,77,75,74,84,67,64,72,78,76,75,71,79,3,74.4,77.4,78,82.4,75.4,3,3.6,8,1,11,-1,2,7,10,12,2,4
144387e9810566b2e408f6b84d15a5f0,3,38,male,2,76,83,59,87,77,83,51,68,67,64,66,62,8,50,94,51,50,51,42,43,51,51,8,89,88,51,51,51,51,51,66,67,100,50,0,50,56,69,44,50,63,63,100,51,0,50,50,26,34,3,76.4,65.4,47.6,57.2,57.8,-11,-28.8,-19.2,-18.6,-32,-32,-33,-33,-1,0,5,-1
a692ccb555347866322e31f1724a3e7e,3,38,male,3,69,86,89,100,100,73,49,76,100,100,100,100,18,50,100,49,69,76,60,51,50,65,18,82,100,81,35,100,100,99,100,100,100,32,0,30,74,100,74,99,100,99,100,49,0,83,50,85,0,3,88.8,95.2,60.4,99.8,94.4,6.4,-28.4,11,5.6,-24,8,-43,10,20,-14,25,1
a851fca51bdfe36457f2919d9d9ee6e9,3,40,female,2,51,50,51,51,50,49,50,51,51,51,50,50,66,34,11,51,51,49,49,51,50,51,51,51,33,49,50,50,50,51,49,51,82,33,1,50,50,50,49,50,50,51,85,50,1,50,50,50,51,3,50.6,50.6,50,50.2,50,0,-0.6,-0.4,-0.6,2,0,1,1,1,0,0,0
9c668898cbbe52c947216b911de51472,3,41,male,4,76,77,52,60,64,67,67,68,74,82,69,75,9,51,50,50,40,74,75,68,65,69,11,65,51,34,66,72,79,83,76,60,45,18,2,20,82,75,67,80,62,76,44,25,7,66,51,59,57,3,65.8,73.6,70.2,74,72,7.8,4.4,8.2,6.2,-17,-33,-47,-1,-27,-1,15,-16
ff8c7fa036a5626e8437505e41bf6c09,1,42,male,2,86,97,98,77,93,50,50,95,94,98,98,98,35,51,50,50,50,98,98,57,70,66,51,51,67,51,82,87,92,92,97,96,19,51,82,49,50,50,15,14,27,51,4,97,96,96,1,0,18,3,90.2,96.6,77.8,92.8,31.4,6.4,-12.4,2.6,-58.8,0,1,-1,46,0,32,0,-49
5a9793e81821671e677a4f9b475bf1ce,2,44,female,1,100,100,100,100,100,51,50,98,97,98,99,98,7,50,100,50,50,98,97,97,99,99,17,50,84,50,50,99,99,99,100,100,68,50,51,50,50,97,97,98,99,98,66,50,51,50,50,51,77,3,100,98,98,99.4,97.8,-2,-2,-0.6,-2.2,-1,-1,-1,-1,0,0,0,0
699b168e119fce96c5560918a8edb62b,0,44,male,1,100,100,100,100,100,51,52,100,100,100,100,100,0,51,0,50,50,100,100,100,100,100,0,51,0,50,51,100,100,100,100,100,100,50,0,51,51,100,100,100,100,100,100,51,0,50,50,51,49,3,100,100,100,100,100,0,0,0,0,-1,-1,0,-1,-2,-1,-1,-2
41ac3480efb87b3ffaece45ac443583c,3,45,female,3,97,96,94,97,97,49,50,97,95,96,98,97,8,50,63,50,51,98,97,94,96,97,3,66,50,49,51,98,97,96,97,97,30,20,19,30,83,97,96,97,97,98,34,50,0,48,45,51,51,3,96.2,96.6,96.4,97,97,0.4,0.2,0.8,0.8,1,0,-19,-1,1,1,33,-5
dcd041a924e581ce16aed7a686653466,0,45,female,1,100,100,100,100,100,50,50,100,100,90,92,91,34,50,50,50,50,84,82,80,76,77,61,59,18,60,41,98,96,94,92,93,100,7,0,33,71,98,96,97,97,97,98,44,0,50,50,75,16,3,100,94.6,79.8,94.6,97,-5.4,-20.2,-5.4,-3,0,10,-17,0,0,-9,21,0
7575b94097420300fe628b1a628a23c9,0,50,female,1,85,98,52,73,99,36,50,98,75,74,97,74,67,50,18,51,80,99,100,100,100,100,83,51,17,51,50,100,100,100,100,100,100,0,0,35,100,100,76,100,100,100,100,50,0,50,50,50,83,3,81.4,83.6,99.8,100,95.2,2.2,18.4,18.6,13.8,15,15,-1,14,30,0,50,0
f5ad782f6c45ae5210ffa14ecc04faf2,1,50,male,5,51,75,74,74,75,50,50,100,74,51,73,100,0,51,100,35,50,50,50,50,49,50,0,68,100,67,50,24,51,50,26,0,100,34,0,36,51,100,74,49,75,100,67,51,0,50,51,33,67,3,69.8,79.6,49.8,30.2,79.6,9.8,-20,-39.6,9.8,-15,17,-14,0,0,0,1,1
1b08d1bb182ef5fc29ec168aa91ecf80,0,52,male,3,74,76,75,75,76,56,59,74,77,79,79,75,51,50,51,50,50,74,75,74,74,74,51,70,56,71,41,95,74,93,95,92,58,50,53,51,49,90,51,51,52,54,59,62,61,82,25,95,51,3,75.2,76.8,74.2,89.8,59.6,1.6,-1,14.6,-15.6,-6,15,-5,26,-9,-18,-10,-34
3c85e5cc483db84ed6be8a3aa2c829bc,1,53,female,3,99,95,94,94,96,50,50,100,99,100,100,99,84,20,82,34,51,99,99,99,100,99,82,50,5,49,50,100,100,100,100,100,100,18,0,18,83,100,100,100,100,100,100,50,0,49,49,1,35,3,95.6,99.6,99.2,100,100,4,3.6,4.4,4.4,-16,-1,-32,-1,1,0,33,-1
512170a86308b1b7335e51a2ee71fbd4,0,54,female,1,100,100,87,100,100,51,51,99,74,75,98,77,2,50,84,50,50,52,51,51,51,51,2,84,90,65,35,98,52,52,52,51,97,50,0,43,59,97,52,51,51,51,100,51,0,50,54,51,51,3,97.4,84.6,51.2,61,60.4,-12.8,-46.2,-36.4,-37,-1,14,-8,-1,-1,-16,8,3
0439eba99c21175f86449024ec523a55,3,56,male,1,73,91,74,77,97,51,51,75,82,80,84,93,73,33,8,34,72,73,54,61,62,73,70,51,10,51,50,75,76,95,92,94,82,34,4,34,67,74,58,56,69,96,83,50,3,53,49,65,21,3,82.4,82.8,64.6,86.4,70.6,0.4,-17.8,4,-11.8,-17,0,-17,2,21,-1,16,-2
f8093d999cb2d0e81586c0ddfc177abb,0,57,male,2,74,73,52,76,73,67,83,74,74,74,74,72,19,51,81,67,68,68,57,60,61,61,19,74,69,83,68,74,76,76,74,76,68,36,18,39,67,75,77,76,78,77,69,50,20,53,53,53,4,3,69.6,73.6,61.4,75.2,76.6,4,-8.2,5.6,7,0,16,-28,-14,-15,-15,-16,-30
e1e3354e7797754e28b994538ce50451,0,60,female,1,75,74,74,98,74,82,34,75,74,74,74,74,18,50,82,50,50,51,27,27,27,28,17,83,83,98,18,75,75,75,74,75,99,50,4,51,67,75,75,75,50,74,97,66,6,66,49,50,2,3,79,74.2,32,74.8,69.8,-4.8,-47,-4.2,-9.2,-32,16,-31,-16,16,-16,33,15
12e24e2b07eaa68869eed40cb4a50273,0,61,female,1,82,87,82,88,82,51,50,74,81,79,84,82,54,50,42,53,54,81,84,84,85,81,65,50,41,63,51,86,88,86,88,91,94,47,9,30,65,88,90,92,92,90,93,40,4,43,72,22,19,3,84.2,80,83,87.8,90.4,-4.2,-1.2,3.6,6.2,2,12,-21,-8,4,1,15,22
