<?xml version="1.0" encoding="iso-8859-1"?>
<!-- Generator: Adobe Illustrator 21.1.0, SVG Export Plug-In . SVG Version: 6.00 Build 0)  -->
<svg version="1.1" id="Layer_1" xmlns="http://www.w3.org/2000/svg" xmlns:xlink="http://www.w3.org/1999/xlink" x="0px" y="0px"
	 viewBox="-49 141 512 512" style="enable-background:new -49 141 512 512;" xml:space="preserve">
<g>
	<path d="M153.667,183.667h-21.333c-5.896,0-10.667,4.771-10.667,10.667v405.333c0,5.896,4.771,10.667,10.667,10.667h21.333
		c5.896,0,10.667-4.771,10.667-10.667V194.333C164.333,188.438,159.563,183.667,153.667,183.667z"/>
	<path d="M95.656,298.344c-7.344-9.208-20.792-10.688-29.979-3.333L-40.99,380.344C-46.052,384.385-49,390.521-49,397
		c0,6.479,2.948,12.615,8.01,16.656L65.677,498.99c3.927,3.146,8.635,4.677,13.313,4.677c6.25,0,12.458-2.74,16.667-8.01
		c7.365-9.198,5.875-22.625-3.333-29.979L6.479,397l85.844-68.677C101.531,320.969,103.021,307.542,95.656,298.344z"/>
	<path d="M452.333,439.667H217.667c-5.896,0-10.667,4.771-10.667,10.667v21.333c0,5.896,4.771,10.667,10.667,10.667h234.667
		c5.896,0,10.667-4.771,10.667-10.667v-21.333C463,444.438,458.229,439.667,452.333,439.667z"/>
	<path d="M452.333,311.667H217.667c-5.896,0-10.667,4.771-10.667,10.667v21.333c0,5.896,4.771,10.667,10.667,10.667h234.667
		c5.896,0,10.667-4.771,10.667-10.667v-21.333C463,316.438,458.229,311.667,452.333,311.667z"/>
	<path d="M452.333,183.667H217.667c-5.896,0-10.667,4.771-10.667,10.667v21.333c0,5.896,4.771,10.667,10.667,10.667h234.667
		c5.896,0,10.667-4.771,10.667-10.667v-21.333C463,188.438,458.229,183.667,452.333,183.667z"/>
	<path d="M452.333,567.667H217.667c-5.896,0-10.667,4.771-10.667,10.667v21.333c0,5.896,4.771,10.667,10.667,10.667h234.667
		c5.896,0,10.667-4.771,10.667-10.667v-21.333C463,572.438,458.229,567.667,452.333,567.667z"/>
</g>
</svg>
