<?xml version="1.0" encoding="iso-8859-1"?>
<!-- Generator: Adobe Illustrator 22.0.0, SVG Export Plug-In . SVG Version: 6.00 Build 0)  -->
<svg version="1.1"
	 xmlns="http://www.w3.org/2000/svg" xmlns:xlink="http://www.w3.org/1999/xlink" x="0px" y="0px" viewBox="0 0 40.982 45"
	 style="enable-background:new 0 0 40.982 45;" xml:space="preserve">
<g>
	<path d="M25.476,31.257c-1.464,0.479-2.984,0.719-4.531,0.719c-3.868,0-7.506-1.51-10.25-4.246
		c-2.735-2.735-4.246-6.373-4.246-10.25c0-3.868,1.51-7.515,4.246-10.25c2.744-2.726,6.382-4.237,10.25-4.237
		c1.879,0,3.711,0.359,5.452,1.059c1.796,0.728,3.417,1.805,4.798,3.187c2.487,2.487,3.978,5.774,4.209,9.274
		c0.175,2.671-0.387,5.314-1.593,7.653l1.98,1.98c1.602-2.606,2.523-5.682,2.523-8.961C38.314,7.69,30.624,0,21.129,0
		c-2.624,0-5.12,0.59-7.34,1.649c-5.867,2.726-9.937,8.666-9.937,15.564v2.855l-3.5,6.686c-0.884,1.685-0.046,3.067,1.86,3.067
		h1.648v6.355c0,1.99,1.621,3.611,3.611,3.611l4.955-0.737l0.009,4.955v0.037c0.028,0.635,0.562,1.059,1.225,0.939l17.867-3.159
		c0.672-0.12,1.225-0.774,1.225-1.465v-4.89l-5.111-5.111C26.94,30.714,26.213,31.018,25.476,31.257L25.476,31.257z M25.476,31.257"
		/>
	<path d="M40.276,33.385l-8.371-8.371l-0.451,0.451l-0.46-0.46c3.693-4.918,3.297-11.926-1.17-16.393
		c-4.9-4.9-12.848-4.9-17.747,0c-4.9,4.899-4.9,12.847,0,17.747c4.476,4.476,11.484,4.862,16.393,1.17l0.46,0.46l-0.452,0.451
		l8.372,8.372c0.948,0.948,2.486,0.948,3.435,0C41.215,35.872,41.215,34.333,40.276,33.385L40.276,33.385z M27.76,24.304
		c-3.767,3.767-9.872,3.767-13.64,0c-3.767-3.767-3.767-9.873,0-13.639c3.767-3.767,9.873-3.767,13.64,0
		C31.527,14.441,31.527,20.547,27.76,24.304L27.76,24.304z M27.76,24.304"/>
	<path d="M22.52,17.489c0,0.87-0.705,1.575-1.575,1.575c-0.87,0-1.575-0.705-1.575-1.575
		c0-0.87,0.705-1.575,1.575-1.575C21.815,15.914,22.52,16.619,22.52,17.489L22.52,17.489z M22.52,17.489"/>
	<path d="M27.382,17.489c0,0.87-0.705,1.575-1.575,1.575c-0.87,0-1.575-0.705-1.575-1.575
		c0-0.87,0.705-1.575,1.575-1.575C26.677,15.914,27.382,16.619,27.382,17.489L27.382,17.489z M27.382,17.489"/>
	<path d="M17.657,17.489c0,0.87-0.705,1.575-1.575,1.575c-0.87,0-1.575-0.705-1.575-1.575
		c0-0.87,0.705-1.575,1.575-1.575C16.952,15.914,17.657,16.619,17.657,17.489L17.657,17.489z M17.657,17.489"/>
</g>
</svg>
