<!-- Generated by IcoMoon.io -->
<svg version="1.1" xmlns="http://www.w3.org/2000/svg" width="1024" height="1024" viewBox="0 0 1024 1024">
<title></title>
<g id="icomoon-ignore">
</g>
<path d="M740.264 0h-456.528c-38.034 0-69.164 31.1-69.164 69.164v885.643c0 38.064 31.13 69.193 69.164 69.193h456.528c38.034 0 69.164-31.071 69.164-69.164v-885.672c0-38.064-31.13-69.164-69.164-69.164zM438.974 49.854h146.052c4.623 0 8.368 3.745 8.368 8.397 0 4.623-3.745 8.368-8.368 8.368h-146.052c-4.623 0-8.368-3.745-8.368-8.368 0-4.652 3.745-8.397 8.368-8.397zM512 989.418c-19.105 0-34.582-15.477-34.582-34.611s15.477-34.582 34.582-34.582 34.582 15.448 34.582 34.582-15.477 34.611-34.582 34.611zM761.3 896h-498.6v-786.315h498.6v786.315z"></path>
</svg>
