<?xml version="1.0" encoding="iso-8859-1"?>
<!-- Generator: Adobe Illustrator 22.0.0, SVG Export Plug-In . SVG Version: 6.00 Build 0)  -->
<svg version="1.1"
	 xmlns="http://www.w3.org/2000/svg" xmlns:xlink="http://www.w3.org/1999/xlink" x="0px" y="0px" viewBox="0 0 45 45"
	 style="enable-background:new 0 0 45 45;" xml:space="preserve">
<g>
	<path d="M13.218,9.843H9.423c-0.564,0-0.846,0.423-0.846,0.846v3.795c0,0.564,0.423,0.846,0.846,0.846h3.795
		c0.563,0,0.846-0.423,0.846-0.846v-3.795C14.064,10.266,13.782,9.843,13.218,9.843L13.218,9.843z M13.218,9.843"/>
	<rect x="16.173" y="11.391" width="20.25" height="2.673"/>
	<path d="M13.218,19.689H9.423c-0.564,0-0.846,0.42-0.846,0.843v3.798c0,0.561,0.423,0.843,0.846,0.843h3.795
		c0.563,0,0.846-0.423,0.846-0.843v-3.798C14.064,20.109,13.782,19.689,13.218,19.689L13.218,19.689z M13.218,19.689"/>
	<path d="M13.218,29.532H9.423c-0.564,0-0.846,0.423-0.846,0.843v3.798c0,0.561,0.423,0.843,0.846,0.843
		h3.795c0.563,0,0.846-0.423,0.846-0.843v-3.798C14.064,29.955,13.782,29.532,13.218,29.532L13.218,29.532z M13.359,34.314
		c0,0.14-0.14,0.14-0.14,0.14H9.423c-0.141,0-0.141-0.14-0.141-0.14v-3.798c0-0.141,0.141-0.141,0.141-0.141h3.795
		c0.14,0,0.14,0.141,0.14,0.141V34.314z M13.359,34.314"/>
	<path d="M26.157,21.234h-9.843v2.673h9C25.173,23.484,25.173,22.217,26.157,21.234L26.157,21.234z
		 M26.157,21.234"/>
	<path d="M16.173,31.077v2.673h9.843c0,0-0.843-1.266-0.984-2.673H16.173z M16.173,31.077"/>
	<path d="M40.782,0H4.218C1.827,0,0,1.827,0,4.218v36.564C0,43.173,1.827,45,4.218,45h36.564
		C43.173,45,45,43.173,45,40.782V4.218C45,1.827,43.173,0,40.782,0L40.782,0z M42.186,40.782c0,0.843-0.279,1.404-1.545,1.404H4.218
		c-0.843,0-1.404-0.561-1.404-1.404V4.218c0-0.843,0.561-1.404,1.404-1.404h36.564c0.843,0,1.404,0.561,1.404,1.404V40.782z
		 M42.186,40.782"/>
	<path d="M44.721,40.782c-0.282-0.564,0-0.423-0.563-0.564c-2.391-0.984-4.5-1.404-6.892-2.25
		c-0.14-0.141-0.846-0.561-0.846-1.686c0-0.423-0.138-0.705-0.702-0.705c-0.141,0-0.141,0-0.141-0.42
		c-0.141-1.125-0.141-1.69-0.141-1.83c0-0.138,0.141-0.279,0.282-0.42c0.843-1.125,0.984-2.532,1.125-3.235
		c0,0,0.141,0.141,0.279-0.282c0.14-0.561,0.282-0.702,0.423-1.266c0.14-0.42,0.282-1.407-0.283-1.407
		c-0.279,0.141-0.279,0-0.279-0.42v-3.097c-0.141-1.125-0.702-1.827-1.266-2.109c-0.705-0.561-0.984-0.702-1.407-0.984
		c-0.279-0.279-0.279-0.561,0-0.984c0.14-0.141,0.423-0.279,0.563-0.42h-0.14c-0.144,0-1.971,0.279-2.674,0.42
		c-1.407,0.282-2.673,0.705-3.797,1.689c-0.702,0.561-1.407,1.404-1.407,2.391v3.093c0,0.282,0,0.423-0.279,0.282
		c-0.702-0.141-0.282,1.125-0.282,1.266c0.141,0.561,0.282,0.844,0.423,1.407C26.859,29.672,27,29.532,27,29.532
		c0.141,0.843,0.561,2.391,1.125,3.234c0.141,0.141,0.141,0.282,0.141,0.423c-0.141,0.561-0.141,1.266-0.141,1.827
		c0,0.141-0.141,0.282-0.282,0.282c-0.56,0-0.56,0.424-0.56,0.702c0,0.843-0.564,1.548-0.846,1.689
		c-1.125,0.844-5.343,2.109-6.75,2.532c-0.984,0.279-1.125,0.561-1.404,0.984l-0.705,1.545h26.439L44.721,40.782z M44.721,40.782"/>
</g>
</svg>
