<!-- Generated by IcoMoon.io -->
<svg version="1.1" xmlns="http://www.w3.org/2000/svg" width="1024" height="1024" viewBox="0 0 1024 1024">
<title></title>
<g id="icomoon-ignore">
</g>
<path d="M128.001 160.004v-128.003c0-17.689 14.311-32 32.004-32 17.685 0 31.996 14.311 31.996 32v128.003c0 17.685-14.311 31.996-31.996 31.996-17.694 0.002-32.004-14.311-32.004-31.996zM672.006 192.002c17.681 0 32-14.311 32-31.996v-128.005c0-17.689-14.319-32-32-32-17.689 0-32.011 14.311-32.011 32v128.003c0 17.685 14.321 31.998 32.011 31.998zM1023.998 767.993c0 141.389-114.621 256.008-255.999 256.008-141.368 0-255.997-114.619-255.997-256.008 0-141.368 114.627-255.993 255.997-255.993 141.379 0 255.999 114.623 255.999 255.993zM960.006 767.993c0-105.86-86.126-191.997-192.005-191.997-105.871 0-191.997 86.134-191.997 191.997 0 105.882 86.126 192.005 191.997 192.005 105.879 0 192.005-86.124 192.005-192.005zM256.004 384.001h-128.003v127.999h128.003v-127.999zM128.001 704.001h128.003v-128.005h-128.003v128.005zM320 512h128.005v-127.999h-128.005v127.999zM320 704.001h128.005v-128.005h-128.005v128.005zM64.005 761.63v-441.631h703.996v128.003h64.003v-249.622c0-38.876-31.006-70.38-69.312-70.38h-26.69v32.007c0 35.246-28.693 63.998-63.992 63.998-35.309 0-64-28.752-64-63.998v-32.007h-384.009v32.007c0 35.246-28.687 63.998-63.992 63.998-35.314 0-64.003-28.752-64.003-63.998v-32.007h-26.659c-38.308 0-69.344 31.504-69.344 70.38v563.252c0 38.747 31.036 70.374 69.344 70.374h378.659v-64.011h-378.659c-2.9-0.002-5.341-2.997-5.341-6.365zM639.996 512v-127.999h-127.992v127.999h127.992zM864.001 767.993h-96.003v-96.003c0-17.679-14.311-31.99-32-31.99s-31.992 14.311-31.992 31.99v128.013c0 17.681 14.302 32 31.992 32h128.003c17.689 0 32-14.319 32-32 0-17.689-14.311-32.011-32-32.011z"></path>
</svg>
