17
0  12  12  12  12  12  12  12  8  8  16  16  16  16  16  16  8
12  0  3  3  3  3  3  3  2  2  2  2  2  2  2  2  0
12  3  0  6  6  6  6  6  4  4  4  4  4  4  4  4  6
12  3  6  0  6  6  6  6  4  4  4  4  4  4  4  4  6
12  3  6  6  0  3  3  3  2  2  2  2  2  2  2  2  0
12  3  6  6  3  0  3  3  2  2  2  2  2  2  2  2  0
12  3  6  6  3  3  0  3  2  2  2  2  2  2  2  2  0
12  3  6  6  3  3  3  0  2  2  2  2  2  2  2  2  0
8   2  4  4  2  2  2  2  0  6  4  4  4  4  4  4  4
8   2  4  4  2  2  2  2  6  0  6  6  6  6  6  6  6
16  2  4  4  2  2  2  2  4  6  0  4  4  4  4  4  2
16  2  4  4  2  2  2  2  4  6  4  0  4  4  4  4  2
16  2  4  4  2  2  2  2  4  6  4  4  0  4  4  4  2
16  2  4  4  2  2  2  2  4  6  4  4  4  0  4  4  2
16  2  4  4  2  2  2  2  4  6  4  4  4  4  0  4  2
16  2  4  4  2  2  2  2  4  6  4  4  4  4  4  0  2
8   0  6  6  0  0  0  0  4  6  2  2  2  2  2  2  0

