**DIRAC                                                                                             
.WAVE FUNCTION                                                                                      
.ANALYZE                                                                                            
.PROPERTIES                                                                                         
**INTEGRALS                                                                                         
*READIN                                                                                             
.UNCONT                                                                                             
**WAVE FUNCTION                                                                                     
.SCF                                                                                                
*SCF                                                                                                
.CLOSED SHELL                                                                                       
6 6                                                                                                 
**PROPERTIES                                                                                        
*EXCITATION ENERGIES                                                                                
.PRINT                                                                                              
10                                                                                                  
.OCCUP                                                                                              
1                                                                                                   
                                                                                                    
.VIRTUAL                                                                                            
                                                                                                    
6                                                                                                   
.ANALYZE                                                                                            
! Excitations s -> p                                                                                
.EXCITATION ! B1u                                                                                   
5 1                                                                                                 
**ANALYZE                                                                                           
.MULPOP                                                                                             
*MULPOP                                                                                             
.VECPOP                                                                                             
1..oo                                                                                               
1..oo                                                                                               
**MOLECULE                                                                                          
*BASIS                                                                                              
.DEFAULT                                                                                            
dyall.ae2z                                                                                          
**END OF                                                                                            
