DIRAC pam run in /home/gomes/devel/Dirac/git/cc-restart/test/fscc_restart
  ** interface to 32-bit integer MPI enabled **

DIRAC master    (phlam-s-meigetsu.univ-lille1.fr) starts by allocating             64000000 words (           488 MB) of memory
DIRAC node    1 (phlam-s-meigetsu.univ-lille1.fr) starts by allocating             64000000 words (           488 MB) of memory
DIRAC node    2 (phlam-s-meigetsu.univ-lille1.fr) starts by allocating             64000000 words (           488 MB) of memory
DIRAC node    3 (phlam-s-meigetsu.univ-lille1.fr) starts by allocating             64000000 words (           488 MB) of memory
DIRAC master    (phlam-s-meigetsu.univ-lille1.fr) to allocate at most             256000000 words (          1953 MB) of memory
 
Note: maximum allocatable memory for master+nodes can be set by -aw flag (MW) in pam
 
DIRAC node    1 (phlam-s-meigetsu.univ-lille1.fr) to allocate at most             256000000 words (          1953 MB) of memory
DIRAC node    2 (phlam-s-meigetsu.univ-lille1.fr) to allocate at most             256000000 words (          1953 MB) of memory
DIRAC node    3 (phlam-s-meigetsu.univ-lille1.fr) to allocate at most             256000000 words (          1953 MB) of memory
 *******************************************************************************
 *                                                                             *
 *                                O U T P U T                                  *
 *                                   from                                      *
 *                                                                             *
 *                   @@@@@    @@   @@@@@     @@@@     @@@@@                    *
 *                   @@  @@        @@  @@   @@  @@   @@                        *
 *                   @@  @@   @@   @@@@@    @@@@@@   @@                        *
 *                   @@  @@   @@   @@ @@    @@  @@   @@                        *
 *                   @@@@@    @@   @@  @@   @@  @@    @@@@@                    *
 *                                                                             *
 *                                                                             *
 %}ZS)S?$=$)]S?$%%>SS$%S$ZZ6cHHMHHHHHHHHMHHM&MHbHH6$L/:<S///</:|/:|:/::!:.::--:%
 $?S$$%$$$$?%?$(SSS$SSSHMMMMMMMMMMMMMMMMMM6H&6S&SH&&k?6$r~::://///::::::.:::-::$
 (%?)Z??$$$(S%$>$)S6HMMMMMMMMMMMMMMMMMMMMMMR6M]&&$6HR$&6(i::::::|i|:::::::-:-::(
 $S?$$)$?$%?))?S/]#MMMMMMMMMMMMMMMMMMMMMMMMMMHM1HRH9R&$$$|):?:/://|:/::/:/.::.:$
 SS$%%?$%((S)?Z[6MMMMMMMMMMMMMMMMMMMMMMMMMMMMMMMMM&HF$$&/)S?<~::!!:::::::/:-:|.S
 SS%%%%S$%%%$$MMMMMMMMMMMMMMMMMMMMMMMMMMMMMMMMMMMHHHHHHM>?/S/:/:::`:/://:/::-::S
 ?$SSSS?%SS$)MMMMMMMMMMMMMMMMMMMMMMMMMMMMMMMMMMMMMMMMMMM/4?:S:/:::/:::/:/:::.::?
 S$(S?S$%(?$HMMMMMMMMMMMMMMMMM#&7RH99MMMMMMMMMMMMMMMMMMHHHd$/:::::/::::::-//.:.S
 (?SS(%)S&HMMMMMMMMMMMMMMMMM#S|///???$9HHMMMMMMMMMDSZ&1S/?</>?~:///::|/!:/-:-:.(
 $S?%?<H(MMMMMMMMMMMMMMMMR?`. :.:`::<>:``?/*?##*)$:/>       `((%://::/:::::/::/$
 S$($$)HdMMMMMMMMMMMMMMMP: . `   `  `    `      `-            `Z<:>?::/:::::|:iS
 c%%%&HMMMMMMMMMMMMMMMM6:                                      `$%)>%%</>!:::::c
 S?%/MMMMMMMMMMMMMMMMMMH-                                        /ZSS>?:?~:;/::S
 $SZ?MMMMMMMMMMMMMMMMMH?.                                        \"&((/?//?|:::$
 $%$%&MMMMMMMMMMMMMMMMM:.                                          ?%/S:</::/::$
 ($?}&HMMMMMMMMMMMMMMMM>:                                          $%%<?/i:|i::(
 Z$($&MMMMMMMMMMMMMMMMHk(:.  . -                                   .S/\?\?/!:/:Z
 (??$<HMMMMMMMMMMMMMMMFk|:   -.-.                                  :%/%/(:/:ii|(
 SZ(S?]MMMMMMMMMMMMMMHS?:- -  ::.:                                  |/S:</::?||S
 $%)$$(MMMMMMMMMMMMMMR):`:. :.:::`,,/bcokb/_                       :S?%?|~:/:/:$
 %$$%$)[[?$?MMMMMMMMMM: :.:-.::::$7?<&7&MMMMMMM#/           _ .. ..:</?:(:/::::%
 $$$?Z?HHH~|/MMMMMMMMM/`.-.:.:/:%%%%?dHMMMMMMMMMMH?,-   .,bMMMM6//./i~/~:<:::/:$
 $($S$M//::S?ZHMMMMMH/:.`:::.:/%S/&MMHMMMMMMMMRM&><   ,HMMMMMMMF  :::?:///:|:::$
 )[$S$S($|_i:#>::*H&?/::.::/:\"://:?>>`:&HMHSMMMM$:`-   MMHMMMMHHT .)i/?////::/)
 $$[$$>$}:dHH&$$--?S::-:.:::--/-:``./::>%Zi?)&/?`:.`   `H?$T*\" `  /%?>%:)://ii$
 $&=&/ZS}$RF<:?/-.|%r/:::/:/:`.-.-..|::S//!`\"``          >??:    `SS<S:)!/////$
 Z&]>b[Z(Z?&%:::../S$$:>:::i`.`. `-.`  `                         ,>%%%:>/>/!|:/Z
 $$&/F&1$c$?>:>?/,>?$$ZS/::/:-: ...                              |S?S)S?<~:::::$
 &$&$&$k&>>|?<:<?((/$[/?)i~/:/. - -                              S?:%%%?/:::/::&
 =[/Z[[Fp[MMH$>?Z&S$$$/$S///||..-           -.-                  /((S$:%<:///:/=
 $&>1MHHMMMM6M9MMMM$Z$}$S%/:::.`.            .:/,,,dcb>/:.       ((SSSS%:)!//i|$
 MMMMMMMMMMMR&&RRRHR&&($(?:|i::-             .:%&S&$[&H&``     ../>%;/?>??:<::>M
 MMMMMMMMMMMMS/}S$&&H&[$SS//:::.:.   . . .v</Jq1&&D]&M&<,      :/::/?%%)S>?://:M
 MMMMMMMMMMMM?}$/$$kMM&&$(%/?//:..`.  .|//1d/`://?*/*/\"` `     .:/(SS$%(S%)):%M
 MMMMMMMMMMMM(}$$>&&MMHR#$S%%:?::.:|-.`:;&&b/D/$p=qpv//b/~`   :/~~%%??$=$)Z$S+;M
 MMMMMMMMMMMM[|S$$Z1]MMMMD[$?$:>)/::: :/?:``???bD&{b<<-`     .,:/)|SS(}Z/$$?/<SM
 MMMMMMMMMMMM||$)&7k&MMMMH9]$$??Z%|!/:i::`  `` .             SS?SS?Z/]1$/&$c/$SM
 MMMMMMMMMMMM| -?>[&]HMMMMMMMH1[/7SS(?:/..-` ::/Sc,/_,     _<$?SS%$S/&c&&$&>//<M
 MMMMMMMMMMMMR  `$&&&HMM9MMMMMMM&&c$%%:/:/:.:.:/\?\?/\    _MMHk/7S/]dq&1S<&&></M
 MMMMMMMMMMMMM?  :&96MHMMMMMMMMMMMHHk[S%(<<:// `         ,MMMMMMM&/Z6H]DkH]1$&&M
 MMMMMMMMMMMMMD    99H9HMMMMMMMMMMMMMMMb&%$<:i.:....    .MMMMMMMMM6HHHRH&H&H1SFM
 MMMMMMMMMMMMMM|   `?HMMMMMMMMMMMMMMMMMMMHk6k&>$&Z$/?_.bHMMMMMMMMMMM&6HRM9H6]ZkM
 MMMMMMMMMMMMMMM/    `TMMMMMMMMMMMMMMMMMMMMMMMMMMMMMMMMMMMMMMMMMMMMMMHMH6RH&R6&M
 MMMMMMMMMMMMMMMM    -|?HMMMMMMMMMMMMMMMMMMMMMMMMMMMMMMMMMMMMMMMMMMMMMFHH6HMD&&M
 MMMMMMMMMMMMMMMMk  ..:~?9MMMMMMMMMMMMM#`:MMMMMMMMMMMMMMMMMMMMMMMMMMMMM9MHkR6&FM
 MMMMMMMMMMMMMMMMM/  .-!:%$ZHMMMMMMMMMR` dMMMMMMMMMMMMMMMMMMMMMMMMMMMMM9MRMHH9&M
 MMMMMMMMMMMMMMMMMML,:.-|::/?&&MMMMMM` .MMMMMMMMMMMMMMMMMMMMMMMMMMMMMMMMHRMH&&6M
 MMMMMMMMMMMMMMMMMMMc%>/:::i<:SMMMMMMHdMMMMMMMMMMMMMMMMMMMMMMMMMMMMMMMMHHM&969kM
 MMMMMMMMMMMMMMMMMMMMSS/$$/(|HMMMMMMMMMMMMMMMMMMMMMMMMMMMMMMMMMMMMMMMMMMMHH&HH&M
 MMMMMMMMMMMMMMMMMMMM6S/?/MMMMMMMMMMMMMMMMMMMMMMMMMMMMMMMMMMMMMMMMMMMMMR96H1DR1M
 MMMMMMMMMMMMMMMMMMMMM&$MHMMMMMMMMMMMMMMMMMMMMMMMMMMMMMMMMMMMMMMMMMMMMMHMH691&&M
 MMMMMMMMMMMMMMMMMMMMMMMMMMMMMMMMMMMMMMMMMMMMMMMMMMMMMMMMMMMMMMMMMMMMMMMMH&R&9ZM
 MMMMMMMMMMMMMMMMMMMMMMMMMRHMMMMMMMMMMMMMMMMMMMMMMMMMMMMMMMMMMMMMMMMMMMMH&96][6M
 MMMMMMMMMMMMMMMMMMMMMMMMp?:MMMMMMMMMMMMMMMMMMMMMMMMMMMMMMMMMMMMMMMMMMM96HH1][FM
 MMMMMMMMMMMMMMMMMMMMMMMM> -HMMMMMMMMMMMMMMMMMMMMMMMMMMMMMMMMMMMMMMMMMMMH&1k&$&M
 *******************************************************************************
 *                                                                             *
 *         =========================================================           *
 *                     Program for Atomic and Molecular                        *
 *          Direct Iterative Relativistic All-electron Calculations            *
 *         =========================================================           *
 *                                                                             *
 *                                                                             *
 *    Written by:                                                              *
 *                                                                             *
 *    Hans Joergen Aa. Jensen  University of Southern Denmark    Denmark       *
 *    Radovan Bast             KTH/PDC Stockholm                 Sweden        *
 *    Trond Saue               Universite P. Sabatier, Toulouse  France        *
 *    Lucas Visscher           VU University Amsterdam           Netherlands   *
 *                                                                             *
 *    with contributions from:                                                 *
 *                                                                             *
 *    Vebjoern Bakken          University of Oslo                Norway        *
 *    Kenneth G. Dyall         Schrodinger, Inc., Portland       USA           *
 *    Sebastien Dubillard      University of Strasbourg          France        *
 *    Ulf Ekstroem             University of Oslo                Norway        *
 *    Ephraim Eliav            University of Tel Aviv            Israel        *
 *    Thomas Enevoldsen        University of Southern Denmark    Denmark       *
 *    Elke Fasshauer           University of Heidelberg          Germany       *
 *    Timo Fleig               Universite P. Sabatier, Toulouse  France        *
 *    Olav Fossgaard           University of Tromsoe             Norway        *
 *    Andre S. P. Gomes        CNRS/Universite Lille 1           France        *
 *    Trygve Helgaker          University of Oslo                Norway        *
 *    Jon K. Laerdahl          University of Oslo                Norway        *
 *    Johan Henriksson         Linkoeping University             Sweden        *
 *    Miroslav Ilias           Matej Bel University              Slovakia      *
 *    Christoph R. Jacob       Karlsruhe Institute of Technology Germany       *
 *    Stefan Knecht            ETH Zuerich                       Switzerland   *
 *    Stanislav Komorovsky     University of Tromsoe             Norway        *
 *    Ossama Kullie            University of Kassel              Germany       *
 *    Christoffer V. Larsen    University of Southern Denmark    Denmark       *
 *    Yoon Sup Lee             KAIST, Daejeon                    South Korea   *
 *    Huliyar S. Nataraj       BME/Budapest Univ. Tech. & Econ.  Hungary       *
 *    Patrick Norman           Linkoeping University             Sweden        *
 *    Malgorzata Olejniczak    University of Warsaw              Poland        *
 *    Jeppe Olsen              Aarhus University                 Denmark       *
 *    Young Choon Park         KAIST, Daejeon                    South Korea   *
 *    Jesper K. Pedersen       University of Southern Denmark    Denmark       *
 *    Markus Pernpointner      University of Heidelberg          Germany       *
 *    Kenneth Ruud             University of Tromsoe             Norway        *
 *    Pawel Salek              Stockholm Inst. of Technology     Sweden        *
 *    Bernd Schimmelpfennig    Forschungszentrum Karlsruhe       Germany       *
 *    Jetze Sikkema            VU University Amsterdam           Netherlands   *
 *    Andreas J. Thorvaldsen   University of Tromsoe             Norway        *
 *    Joern Thyssen            University of Southern Denmark    Denmark       *
 *    Joost van Stralen        VU University Amsterdam           Netherlands   *
 *    Sebastien Villaume       Linkoeping University             Sweden        *
 *    Olivier Visser           University of Groningen           Netherlands   *
 *    Toke Winther             University of Southern Denmark    Denmark       *
 *    Shigeyoshi Yamamoto      Chukyo University                 Japan         *
 *                                                                             *
 *    For the complete list of contributors to the DIRAC code see our          *
 *    website http://www.diracprogram.org                                      *
 *                                                                             *
 *    This is an experimental code. The authors accept no responsibility       *
 *    for the performance of the code or for the correctness of the results.   *
 *                                                                             *
 *    The code (in whole or part) is not to be reproduced for further          *
 *    distribution without the written permission of the authors or            *
 *    their representatives.                                                   *
 *                                                                             *
 *    If results obtained with this code are published, an                     *
 *    appropriate citation would be:                                           *
 *                                                                             *
 *    DIRAC, a relativistic ab initio electronic structure program,            *
 *    Release DIRAC13 (2013),                                                  *
 *    written by L. Visscher, H. J. Aa. Jensen, R. Bast, and T. Saue,          *
 *    with contributions from V. Bakken, K. G. Dyall, S. Dubillard,            *
 *    U. Ekstroem, E. Eliav, T. Enevoldsen, E. Fasshauer, T. Fleig,            *
 *    O. Fossgaard, A. S. P. Gomes, T. Helgaker, J. K. Laerdahl, Y. S. Lee,    *
 *    J. Henriksson, M. Ilias, Ch. R. Jacob, S. Knecht, S. Komorovsky,         *
 *    O. Kullie, C. V. Larsen, H. S. Nataraj, P. Norman, G. Olejniczak,        *
 *    J. Olsen, Y. C. Park, J. K. Pedersen, M. Pernpointner, K. Ruud,          *
 *    P. Salek, B. Schimmelpfennig, J. Sikkema, A. J. Thorvaldsen, J. Thyssen, *
 *    J. van Stralen, S. Villaume, O. Visser, T. Winther, and S. Yamamoto      *
 *    (see http://www.diracprogram.org).                                       *
 *                                                                             *
 *******************************************************************************


Binary information
------------------

 Who compiled             | gomes
 Host                     | phlam-s-meigetsu.univ-lille1.fr
 System                   | Linux-2.6.32-431.11.2.el6.x86_64
 CMake generator          | Unix Makefiles
 Processor                | x86_64
 64-bit integers          | OFF
 MPI                      | ON
 Fortran compiler         | /share/apps/intel/impi/4.1.0.024/intel64/bin/mpiif
                          | ort
 Fortran compiler version | unknown
 C compiler               | /share/apps/intel/impi/4.1.0.024/intel64/bin/mpiic
                          | c
 C compiler version       | unknown
 C++ compiler             | /share/apps/intel/impi/4.1.0.024/intel64/bin/mpiic
                          | pc
 C++ compiler version     | unknown
 Static linking           | OFF
 Last Git revision        | ed91afe3ee269aa6833d15c1f122b27b56690795
 Git branch               | cc-restart
 Configuration time       | 2014-11-20 17:40:43.173329


Execution time and host
-----------------------

 
     Date and time (Linux)  : Thu Nov 20 17:41:35 2014
     Host name              : phlam-s-meigetsu.univ-lille1.fr         


Contents of the input file
--------------------------

!                                                                                                   
**DIRAC                                                                                             
.TITLE                                                                                              
Magnesium atom. Fockspace test calculations.                                                        
.WAVE F                                                                                             
.NO4INDEX                                                                                           
**HAMILTONIAN                                                                                       
.DOSSSS                                                                                             
**WAVE FUNCTIONS                                                                                    
#.SCF                                                                                               
.RELCCSD                                                                                            
*SCF                                                                                                
.EVCCNV                                                                                             
1.0E-10 1.0E-8                                                                                      
.CNVINT                                                                                             
0.01 0.0001                                                                                         
.CLOSED SHELL                                                                                       
4 6                                                                                                 
**MOLTRA                                                                                            
.ACTIVE                                                                                             
energy -1000.0 1000.0 1.0                                                                           
energy -1000.0 1000.0 1.0                                                                           
**RELCC                                                                                             
.FOCKSP                                                                                             
.RESTART                                                                                            
#.ENERGY                                                                                            
.PRINT                                                                                              
1                                                                                                   
#.DEBUG                                                                                             
*CCENER                                                                                             
.MAXIT # maximum number of iterations for (0,0) sector                                              
8                                                                                                   
.NTOL                                                                                               
9                                                                                                   
*CCFSPC                                                                                             
.MAXIT # maximum number of iterations for sectors                                                   
8                                                                                                   
.DOEA     #  (0,1) sector                                                                           
.DOEA2    #  (0,2) sector                                                                           
.DOIE     #  (1,0) sector                                                                           
.DOIE2    #  (2,0) sector                                                                           
.DOEXC    #  (1,1) sector                                                                           
.NACTH                                                                                              
0 0 3 3                                                                                             
.NACTP                                                                                              
2 2 3 3                                                                                             
*CCRESTART                                                                                          
.SKIPSECT                                                                                           
 01 00 11 02 20                                                                                     
*END OF                                                                                             


Contents of the molecule file
-----------------------------

INTGRL                                                                                              
Magnesium                                                                                           
Basis from E. Eliav, Huzinaga book or something like that                                           
C   1    3  X  Y  Z                                                                                 
       12.    1                                                                                     
Mg     .0000000000        0.0000000000        0.0000000000                                          
LARGE    3   1   1   1                                                                              
    6    0    3                                                                                     
111.22700000                                                                                        
19.39270000                                                                                         
2.03032000                                                                                          
.67345900                                                                                           
.05681520                                                                                           
.02434120                                                                                           
    3    0    3                                                                                     
10.04051000                                                                                         
2.26735000                                                                                          
.57451700                                                                                           
    1    0    3                                                                                     
.90000000                                                                                           
FINISH                                                                                              
                                                                                                    


    **************************************************************************
    ************** Magnesium atom. Fockspace test calculations. **************
    **************************************************************************

 Jobs in this run:
   * Wave function


    **************************************************************************
    ************************** General DIRAC set-up **************************
    **************************************************************************

   CODATA Recommended Values of the Fundamental Physical Constants: 1998  
                Peter J. Mohr and Barry N. Taylor                         
   Journal of Physical and Chemical Reference Data, Vol. 28, No. 6, 1999  
 * The speed of light :        137.0359998
 * Running in four-component mode
 * Parallel run with 3 slaves.
 * Direct evaluation of the following two-electron integrals:
   - LL-integrals
   - SL-integrals
   - SS-integrals
   - GT-integrals
 * Spherical transformation embedded in MO-transformation
   for large components
 * Transformation to scalar RKB basis embedded in
   MO-transformation for small components
 * Thresholds for linear dependence:
   Large components:   1.00D-06
   Small components:   1.00D-08
 * General print level   :   0


    *************************************************************************
    ****************** Output from HERMIT input processing ******************
    *************************************************************************



    *************************************************************************
    ****************** Output from READIN input processing ******************
    *************************************************************************



  Title Cards
  -----------

  Magnesium                                                               
  Basis from E. Eliav, Huzinaga book or something like that               

  Nuclear Gaussian exponent for atom of charge  12.000 :    4.7254270882D+08


  Symmetry Operations
  -------------------

  Symmetry operations: 3



                          SYMGRP:Point group information
                          ------------------------------

Point group: D2h

   * The point group was generated by:

      Reflection in the yz-plane
      Reflection in the xz-plane
      Reflection in the xy-plane

   * Group multiplication table

        |  E   C2z  C2y  C2x   i   Oxy  Oxz  Oyz
   -----+----------------------------------------
     E  |  E   C2z  C2y  C2x   i   Oxy  Oxz  Oyz
    C2z | C2z   E   C2x  C2y  Oxy   i   Oyz  Oxz
    C2y | C2y  C2x   E   C2z  Oxz  Oyz   i   Oxy
    C2x | C2x  C2y  C2z   E   Oyz  Oxz  Oxy   i 
     i  |  i   Oxy  Oxz  Oyz   E   C2z  C2y  C2x
    Oxy | Oxy   i   Oyz  Oxz  C2z   E   C2x  C2y
    Oxz | Oxz  Oyz   i   Oxy  C2y  C2x   E   C2z
    Oyz | Oyz  Oxz  Oxy   i   C2x  C2y  C2z   E 

   * Character table

        |  E   C2z  C2y  C2x   i   Oxy  Oxz  Oyz
   -----+----------------------------------------
    Ag  |   1    1    1    1    1    1    1    1
    B3u |   1   -1   -1    1   -1    1    1   -1
    B2u |   1   -1    1   -1   -1    1   -1    1
    B1g |   1    1   -1   -1    1    1   -1   -1
    B1u |   1    1   -1   -1   -1   -1    1    1
    B2g |   1   -1    1   -1    1   -1    1   -1
    B3g |   1   -1   -1    1    1   -1   -1    1
    Au  |   1    1    1    1   -1   -1   -1   -1

   * Direct product table

        | Ag   B3u  B2u  B1g  B1u  B2g  B3g  Au 
   -----+----------------------------------------
    Ag  | Ag   B3u  B2u  B1g  B1u  B2g  B3g  Au 
    B3u | B3u  Ag   B1g  B2u  B2g  B1u  Au   B3g
    B2u | B2u  B1g  Ag   B3u  B3g  Au   B1u  B2g
    B1g | B1g  B2u  B3u  Ag   Au   B3g  B2g  B1u
    B1u | B1u  B2g  B3g  Au   Ag   B3u  B2u  B1g
    B2g | B2g  B1u  Au   B3g  B3u  Ag   B1g  B2u
    B3g | B3g  Au   B1u  B2g  B2u  B1g  Ag   B3u
    Au  | Au   B3g  B2g  B1u  B1g  B2u  B3u  Ag 


                            **************************
                            *** Output from DBLGRP ***
                            **************************

   * Two fermion irreps:  E1g  E1u
   * Real group. NZ = 1
   * Direct product decomposition:
          E1g x E1g : Ag  + B1g + B2g + B3g
          E1u x E1g : Au  + B1u + B2u + B3u
          E1u x E1u : Ag  + B1g + B2g + B3g


                                 Spinor structure
                                 ----------------


   * Fermion irrep no.: 1            * Fermion irrep no.: 2

      La  |  Ag (1)  B1g(2)  |                La  |  Au (1)  B1u(2)  |
      Sa  |  Au (1)  B1u(2)  |                Sa  |  Ag (1)  B1g(2)  |
      Lb  |  B2g(3)  B3g(4)  |                Lb  |  B2u(3)  B3u(4)  |
      Sb  |  B2u(3)  B3u(4)  |                Sb  |  B2g(3)  B3g(4)  |


                              Quaternion symmetries
                              ---------------------

    Rep  T(+)
    -----------------------------
    Ag   1
    B3u  k
    B2u  j
    B1g  i
    B1u  i
    B2g  j
    B3g  k
    Au   1


  Atoms and basis sets
  --------------------

  Number of atom types:     1
  Total number of atoms:    1

  label    atoms   charge   prim    cont     basis   
  ----------------------------------------------------------------------
  Mg          1      12      21      21      L  - [6s3p1d|6s3p1d]                                                
                             52      52      S  - [3s7p3d1f|3s7p3d1f]                                            
  ----------------------------------------------------------------------
                             21      21      L  - large components
                             52      52      S  - small components
  ----------------------------------------------------------------------
  total:      1      12      73      73

  Cartesian basis used.
  Threshold for integrals (to be written to file):  1.00D-15


  References for the basis sets
  -----------------------------

  Atom type   1
  Basis set typed explicitly in input file                                        


  Cartesian Coordinates
  ---------------------

  Total number of coordinates:  3


   1   Mg       x      0.0000000000
   2            y      0.0000000000
   3            z      0.0000000000



  Cartesian coordinates xyz format (angstrom)
  -------------------------------------------

    1
 
Mg     0.0000000000   0.0000000000   0.0000000000


  Symmetry Coordinates
  --------------------

  Number of coordinates in each symmetry:   0  1  1  0  1  0  0  0


  Symmetry 2

   1   Mg    x    1


  Symmetry 3

   2   Mg    y    2


  Symmetry 5

   3   Mg    z    3
  Nuclear repulsion energy :    0.000000000000


                                GETLAB: AO-labels
                                -----------------

   * Large components:   10
     1  L Mg  1 s        2  L Mg  1 px       3  L Mg  1 py       4  L Mg  1 pz       5  L Mg  1 dxx      6  L Mg  1 dxy 
     7  L Mg  1 dxz      8  L Mg  1 dyy      9  L Mg  1 dyz     10  L Mg  1 dzz 
   * Small components:   20
    11  S Mg  1 s       12  S Mg  1 px      13  S Mg  1 py      14  S Mg  1 pz      15  S Mg  1 dxx     16  S Mg  1 dxy 
    17  S Mg  1 dxz     18  S Mg  1 dyy     19  S Mg  1 dyz     20  S Mg  1 dzz     21  S Mg  1 fxxx    22  S Mg  1 fxxy
    23  S Mg  1 fxxz    24  S Mg  1 fxyy    25  S Mg  1 fxyz    26  S Mg  1 fxzz    27  S Mg  1 fyyy    28  S Mg  1 fyyz
    29  S Mg  1 fyzz    30  S Mg  1 fzzz


                                GETLAB: SO-labels
                                -----------------

   * Large components:   10
     1  L Ag Mg s        2  L Ag Mg dxx      3  L Ag Mg dyy      4  L Ag Mg dzz      5  L B3uMg px       6  L B2uMg py  
     7  L B1gMg dxy      8  L B1uMg pz       9  L B2gMg dxz     10  L B3gMg dyz 
   * Small components:   20
    11  S Ag Mg s       12  S Ag Mg dxx     13  S Ag Mg dyy     14  S Ag Mg dzz     15  S B3uMg px      16  S B3uMg fxxx
    17  S B3uMg fxyy    18  S B3uMg fxzz    19  S B2uMg py      20  S B2uMg fxxy    21  S B2uMg fyyy    22  S B2uMg fyzz
    23  S B1gMg dxy     24  S B1uMg pz      25  S B1uMg fxxz    26  S B1uMg fyyz    27  S B1uMg fzzz    28  S B2gMg dxz 
    29  S B3gMg dyz     30  S Au Mg fxyz


  Symmetry Orbitals
  -----------------

  Number of orbitals in each symmetry:           21    13    13     4    13     4     4     1
  Number of large orbitals in each symmetry:      9     3     3     1     3     1     1     0
  Number of small orbitals in each symmetry:     12    10    10     3    10     3     3     1

* Large component functions

  Symmetry  Ag ( 1)

        6 functions:    Mg s   
        1 functions:    Mg dxx 
        1 functions:    Mg dyy 
        1 functions:    Mg dzz 

  Symmetry  B3u( 2)

        3 functions:    Mg px  

  Symmetry  B2u( 3)

        3 functions:    Mg py  

  Symmetry  B1g( 4)

        1 functions:    Mg dxy 

  Symmetry  B1u( 5)

        3 functions:    Mg pz  

  Symmetry  B2g( 6)

        1 functions:    Mg dxz 

  Symmetry  B3g( 7)

        1 functions:    Mg dyz 

* Small component functions

  Symmetry  Ag ( 1)

        3 functions:    Mg s   
        3 functions:    Mg dxx 
        3 functions:    Mg dyy 
        3 functions:    Mg dzz 

  Symmetry  B3u( 2)

        7 functions:    Mg px  
        1 functions:    Mg fxxx
        1 functions:    Mg fxyy
        1 functions:    Mg fxzz

  Symmetry  B2u( 3)

        7 functions:    Mg py  
        1 functions:    Mg fxxy
        1 functions:    Mg fyyy
        1 functions:    Mg fyzz

  Symmetry  B1g( 4)

        3 functions:    Mg dxy 

  Symmetry  B1u( 5)

        7 functions:    Mg pz  
        1 functions:    Mg fxxz
        1 functions:    Mg fyyz
        1 functions:    Mg fzzz

  Symmetry  B2g( 6)

        3 functions:    Mg dxz 

  Symmetry  B3g( 7)

        3 functions:    Mg dyz 

  Symmetry  Au ( 8)

        1 functions:    Mg fxyz


   ***************************************************************************
   *************************** Hamiltonian defined ***************************
   ***************************************************************************

 * Print level:    0
 * Dirac-Coulomb Hamiltonian
 * Default integral flags passed to all modules
   - LL-integrals:     1
   - LS-integrals:     1
   - SS-integrals:     1
   - GT-integrals:     0
 * Basis set:
   - uncontracted large component basis set
   - uncontracted small component basis set


 Information about the restricted kinetic balance scheme:
 * Default RKB projection:
   1: Pre-projection in scalar basis
   2: Removal of unphysical solutions (via diagonalization of free particle Hamiltonian)


    **************************************************************************
    ************************** Wave function module **************************
    **************************************************************************

 Wave function types requested (in input order):
     RELCCSD   

 Wave function jobs in execution order (expanded):
 * Run RELCCSD code
===========================================================================
 SCFINP: Set-up for Hartree-Fock calculation:
===========================================================================
 * Number of fermion irreps: 2
 * Closed shell SCF calculation with    10 electrons in
       2 orbitals in Fermion irrep 1 and    3 orbitals in Fermion irrep 2

  EHMIN:  1000.00000 EHMAX:   100.00000
  EPMIN:    -1.00000 EPMAX: -1000.00000


 ********************************************************************************
 *************************** Input consistency checks ***************************
 ********************************************************************************



    *************************************************************************
    ************************ End of input processing ************************
    *************************************************************************

* WARNING: DIRAC found file AOMOMAT (transformation matrices)  ...will attempt restart.
*** Restart successful !
  * WARNING: DIRAC found the AOPROPER file (one-electron integrals) ...will attempt restart.

---< Process     1 of     4----<



 Relativistic Coupled Cluster program RELCCSD

 Written by :
 Lucas Visscher

 NASA Ames Research Center    (1994)
 Rijks Universiteit Groningen (1995)
 Odense Universitet           (1996-1997)
 VU University Amsterdam (1998-present)


 This module is documented in
  - Initial implementation : L. Visscher, T.J. Lee and K.G. Dyall, J. Chem. Phys. 105 (1996) 8769.
  - Fock Space (FSCC):       L. Visscher, E. Eliav and U. Kaldor, J. Chem. Phys. 115 (2002) 9720.
  - Intermediate Hamiltonian E. Eliav, M. J. Vilkas, Y. Ishikawa, and U. Kaldor, J. Chem. Phys. 122 (2005) 224113.
  - Parallelization :        M. Pernpointner and L. Visscher, J. Comp. Chem. 24 (2003) 754.


 Today is :   20 Nov 14 
 The time is :  17:41:35

 Initializing word-addressable I/O : the FORTRAN-interface is used with    16 KB records

  EHMIN:  1000.00000 EHMAX:   100.00000
  EPMIN:    -1.00000 EPMAX: -1000.00000

 Total memory available :                                   1953 MB
 INFO: Found restart file(s)!

 Configuration in highest pointgroup

                                          Eg   Eg   Eu   Eu
 Spinor class : occupied                   2    2    3    3
 Spinor class : virtual                    9    9    6    6


 Configuration in abelian subgroup

                                         1Eg  2Eg  1Eu  2Eu
 Spinor class : occupied                   2    2    3    3
 Spinor class : virtual                    9    9    6    6


 Number of electrons :                    10
 Total charge of the system :              2
 Number of virtual spinors :              30
 Complex arithmetic mode :                 F
 Do integral sorting     :                 F
 Do energy calculation   :                 F
 Do gradient calculation :                 F
 Do response calculation :                 F
 Debug information       :                 F
 Timing information      :                 F
 Print level          :                    1
 Memory limit (MWord) :                       244
 Interface used       :                DIRAC6    


 Memory for reading and sorting integrals :               215545 8-byte words
 Memory for reading and sorting integrals :              1862193 8-byte words
 Core used for Fock space CCSD energies :                   255410284 8-byte words
 Memory used for active modules :                      255410284 8-byte words


 Fock space CCSD Energy calculations
 Module written by Ephraim Eliav & Luuk Visscher, July 1999


 List of inactive and active spinors (Fock space)

 Configuration in highest pointgroup

                                          Eg   Eg   Eu   Eu
 Spinor class : inactive occupied          2    2    0    0
 Spinor class : active occupied            0    0    3    3
 Spinor class : active virtual             2    2    3    3
 Spinor class : inactive virtual           7    7    3    3


 Configuration in abelian subgroup

                                         1Eg  2Eg  1Eu  2Eu
 Spinor class : inactive occupied          2    2    0    0
 Spinor class : active occupied            0    0    3    3
 Spinor class : active virtual             2    2    3    3
 Spinor class : inactive virtual           7    7    3    3

 Expanding and sorting integrals to unique types :
 Type OOOO :            9076 integrals
 Type VOOO :           34200 integrals
 Type VVOO :           30024 integrals
 Type VOVO :          129600 integrals
 Type VOVV :          113400 integrals
 Type VVVV :           99468 integrals
 
 Restart: using prior OOOO to VOVO sorted integral
 
     Warning: No consistency checks yet
 
      Please verify the number of active spinors and the size of the model space
      (in FSCC calculations) has not changed between this restart and the prior run
 
 Restart: using prior VOVV sorted integrals       
 
     Warning: No consistency checks yet
 
      Please verify the number of active spinors and the size of the model space
      (in FSCC calculations) has not changed between this restart and the prior run
 
 Restart: using prior VVVV sorted integrals       
 
     Warning: No consistency checks yet
 
      Please verify the number of active spinors and the size of the model space
      (in FSCC calculations) has not changed between this restart and the prior run

 Finished sorting of integrals


 Checking the orbital energies, the program computes the diagonal elements of the
 reconstructed Fock matrix. Differences with the reference orbital energies
 are given if above a treshold or if iprnt > 1

 Spinor   Abelian Rep.         Energy   Recalc. Energy
  Oi   1    1   1Eg      -47.8128418774  -47.8128418773
  Oi   2    2   1Eg       -4.4192776247   -4.4192776247
  Va   3    3   1Eg       -0.5193043223   -0.5193043222
  Va   4    4   1Eg       -0.2214473834   -0.2214473834
  Oi   1    5   2Eg      -47.8128418774  -47.8128418773
  Oi   2    6   2Eg       -4.4192776247   -4.4192776247
  Va   3    7   2Eg       -0.5193043223   -0.5193043222
  Va   4    8   2Eg       -0.2214473834   -0.2214473834
  Oa   1    9   1Eu       -2.9873773102   -2.9873773102
  Oa   2   10   1Eu       -2.9797814278   -2.9797814278
  Oa   3   11   1Eu       -2.9797814278   -2.9797814278
  Va   4   12   1Eu        0.6304360582    0.6304360582
  Va   5   13   1Eu        0.6335572180    0.6335572180
  Va   6   14   1Eu        0.6335572180    0.6335572180
  Oa   1   15   2Eu       -2.9873773102   -2.9873773102
  Oa   2   16   2Eu       -2.9797814278   -2.9797814278
  Oa   3   17   2Eu       -2.9797814278   -2.9797814278
  Va   4   18   2Eu        0.6304360582    0.6304360582
  Va   5   19   2Eu        0.6335572180    0.6335572180
  Va   6   20   2Eu        0.6335572180    0.6335572180

 The diagonal elements of the recomputed Fock matrix (right column) are used in perturbation expressions.

 Use the perturbative values (MP2, CCSD[T]/(T)/-T) with care, especially
 in  open shell calculations because the orbitals need not always be
 semi-canonical as was assumed in the derivation of the expressions.
 The missing terms may be important !


 Nuclear repulsion + core energy :             0.000000000000000
 Zero order electronic energy :             -122.358119335793816
 First order electronic energy :             -70.061924768742799
 Electronic energy :                        -192.420044104536601
 SCF energy :                               -192.420044104536601


 Fock space CCSD options :
 Maximum number of iterations :            8
 Maximum size of DIIS space :              8
 Convergence criterium :             0.1E-11
 INFO: Reading restartable amplitudes!


 Solving equations for sector 00

 ... restarting: sector converged or skipped


 Solving equations for sector 01

 ... restarting: sector converged or skipped


 Solving equations for sector 10

  ...maximum number of iterations for this sector:  8


   NIT          ENERGY                    RMS       T1-DIAGN
    0       -0.131135458439471   1.000000000000000   0.00499
    1       -0.131135458439478   1.111346345702010   0.00499
    2       -0.131135458439478   0.158303379511675   0.00499
    3       -0.131135458439478   0.012048956111320   0.00499
    4       -0.131135458439477   0.000272439482838   0.00499
    5       -0.131135458439477   0.000009101392424   0.00499
    6       -0.131135458439477   0.000008915603969   0.00499
    7       -0.131135458439477   0.000000300044128   0.00499
    8       -0.131135458439477   0.000000012955724   0.00499


 WARNING: Requested convergence not reached in CCSD :RMS =    0.000000012955724


  CCSD results

 T1 diagnostic :                               0.004990476710389
 Convergence :                                 0.000000012955724
 Number or iterations used :                                   8

 ( 1 au = 27.2113834378 eV  /  219474.631280634 cm-1)


 Energy eigenvalues in atomic units

 Level   Rel eigenvalue     Abs eigenvalue      Total Energy    Degeneracy

    1     0.0000000000      2.893502063510     -189.657677499466 (   4 * )
    2     0.0070590853      2.900561148799     -189.650618414177 (   2 * )


 Total average:      -189.6553244710


 Relative real eigenvalues in other units;
 Symmetry Classification in the Abelian subgroup

 Level  eigenvalue (eV)  Eigenvalue (cm-1)   1Eg| 2Eg| 1Eu| 2Eu|
    1        0.000000000          0.000000     0|   0|   2|   2|
    2        0.192087477       1549.290141     0|   0|   1|   1|


 Analysis of eigenvectors of the effective Hamiltonian
 First line  :  Energy, Eigenvalue
 other lines : Coefficients of contributing determinants (above a treshold of .1E-02)

 Irrep  1Eu State     1   -189.65767750      2.89350206
        0.81019   |  1Eu #   2 (  -2.980) |                         
       -0.58616   |  1Eu #   3 (  -2.980) |                         

 Irrep  1Eu State     2   -189.65767750      2.89350206
       -0.66183   |  1Eu #   2 (  -2.980) |                         
       -0.74966   |  1Eu #   3 (  -2.980) |                         

 Irrep  1Eu State     3   -189.65061841      2.90056115
       -1.00000   |  1Eu #   1 (  -2.987) |                         

 Irrep  2Eu State     1   -189.65767750      2.89350206
        0.81857   |  2Eu #   2 (  -2.980) |                         
       -0.57440   |  2Eu #   3 (  -2.980) |                         

 Irrep  2Eu State     2   -189.65767750      2.89350206
        0.64343   |  2Eu #   2 (  -2.980) |                         
        0.76551   |  2Eu #   3 (  -2.980) |                         

 Irrep  2Eu State     3   -189.65061841      2.90056115
       -1.00000   |  2Eu #   1 (  -2.987) |                         


 Solving equations for sector 11

 ... restarting: sector converged or skipped


 Solving equations for sector 02

 ... restarting: sector converged or skipped


 Solving equations for sector 20

 ... restarting: sector converged or skipped


--------------------------------------------------------------------------------


 Today is :   20 Nov 14 
 The time is :  17:41:36

 Status of the calculations
 Integral sort # 1 :                   Completed, restartable        
 Integral sort # 2 :                   Completed, restartable        
 Fock matrix build :                   Completed, restartable        
 MP2 energy calculation :              Completed, restartable        
 CCSD energy calculation :             On menu but not yet called    
 CCSD(T) energy calculation :          On menu but not yet called    
 CCSD(T) energy calculation :          Never asked for               

 Overview of calculated energies
@ SCF energy :                              -192.420044104536601
@ MP2 correlation energy :                     0.000000000000000
@ CCSD correlation energy :                   -0.131135458439477
@ 4th order triples correction :               0.000000000000000
@ 5th order triples (T) correction :           0.000000000000000
@ 5th order triples -T  correction :           0.000000000000000
@ Total MP2 energy :                        -192.420044104536601
@ Total CCSD energy :                       -192.551179562976074
@ Total CCSD+T  energy :                    -192.551179562976074
@ Total CCSD(T) energy :                    -192.551179562976074
@ Total CCSD-T  energy :                    -192.551179562976074


--------------------------------------------------------------------------------

------ Timing report (in CPU seconds) of module  RELCCSD                      



                                    Master   --------- Slaves ------------

 Timer                              Master   Minimum   Maximum     Average

 - T1 equations                        0.1       0.0       0.0       0.0
 --- T1EQNS HOV*T2(A,C,I,K             0.0       0.0       0.0       0.0
 --- T1EQNS   HV*T / T*HO              0.0       0.0       0.0       0.0
 --- T1EQNS VOOO*TAU                   0.0       0.0       0.0       0.0
 --- T1EQNS VOVV contribution          0.0       0.0       0.0       0.0
 --- T1EQNS VOVO * T(C,K)              0.0       0.0       0.0       0.0
 - T2 equations                        0.2       0.2       0.2       0.2
 -- GOINTM                             0.0       0.0       0.0       0.0
 -- GVINTM                             0.0       0.0       0.0       0.0
 -- AINTM                              0.0       0.0       0.0       0.0
 -- HINTM                              0.1       0.1       0.1       0.1
 --- HINTM: VOVV*T                     0.0       0.0       0.0       0.0
 --- HINTM: VVOO contribution          0.0       0.0       0.0       0.0
 -- combining HINTM via MPI_ALL        0.0       0.0       0.1       0.1
 -- T2 EQNS                            0.1       0.1       0.1       0.1
 --- T2EQNS: TAU*AINTM contract        0.0       0.0       0.0       0.0
 --- T2EQNS: VOVV*T1                   0.0       0.0       0.0       0.0
 --- T2EQNS: HINTM*T2                  0.0       0.0       0.0       0.0
 -- BINTM                              0.0       0.0       0.0       0.0
 - adding partial T1/T2 amplitu        0.0       0.0       0.0       0.0
 - DIIS extrapolation                  0.0       0.0       0.0       0.0
 - synchronizing T1 & T2 amplit        0.0       0.0       0.0       0.0

------ End of timing report ------



 Timing of main modules :         Wallclock (s)       CPU on master (s)
 Before CC driver :              23887.69                     0.08
 Initialization :                    0.08                     0.09
 Integral sorting :                  0.00                     0.00
 Energy calculation :                0.00                     0.00
 First order properties :            0.00                     0.00
 Second order properties :           0.00                     0.00
 Fock space energies :               0.00                     0.43
 Untimed parts :                     0.43                     0.00
 Total time in CC driver :             1.                     0.52

 Statistics for the word-addressable I/O
 Number of write calls                                 488.
 Number of read calls                                  488.
 Megabytes written                                    5.766
 Megabytes read                                      77.838
 Seconds spent in reads                               0.023
 Seconds spent in writes                              0.023
 average I/O speed for write (Mb/s)                 245.999
 average I/O speed for read  (Mb/s)                3321.092
 I AM IN SYNC PROC., MYPROC =            0
 I AM IN SYNC PROC., MYPROC =            0
 SYNC. PROCESS HAS USED           0 SEC.


 CPU time (seconds) used in RELCCSD:                     0.5209
 CPU time (seconds) used before RELCCSD:                 0.0780
 CPU time (seconds) used in total sofar:                 0.5989

  --- Normal end of RELCCSD Run ---


################################################################################

*****************************************************
********** E N D   of   D I R A C  output  **********
*****************************************************


 
     Date and time (Linux)  : Thu Nov 20 17:41:37 2014
     Host name              : phlam-s-meigetsu.univ-lille1.fr         

>>>> Node 0, utime: 1, stime: 0, minflt: 6509, majflt: 0, nvcsw: 46, nivcsw: 172, maxrss: 82504
>>>> Total WALL time used in DIRAC: 2s
  
  
  
  
  Dynamical Memory Usage Summary
  
  Mean allocation size (Mb) :        13.09
  
  Largest          10  allocations
  
      488.28 Mb at subroutine pamset_+0x1a91                             for WORK in PAMSET - 2                        
      488.28 Mb at subroutine pamset_+0xab                               for WORK in PAMSET - 1                        
      488.28 Mb at subroutine MAIN__+0x569                               for test allocation of work array in DIRAC mai
       10.94 Mb at subroutine ccseti_+0x783                              for ibuf                                      
       10.94 Mb at subroutine ccseti_+0x783                              for ibuf                                      
        1.00 Mb at subroutine ccseti_+0xab2                              for vta                                       
        1.00 Mb at subroutine ccseti_+0xa88                              for vt                                        
        1.00 Mb at subroutine ccseti_+0xab2                              for vta                                       
        1.00 Mb at subroutine ccseti_+0xa88                              for vt                                        
        0.99 Mb at subroutine ccfspc_+0xf01                              for buf3                                      
  
  Peak memory usage    (Mb) :       488.00
       reached at subroutine : pamset_+0x1a91                            
              for variable   : WORK in PAMSET - 2                        
  
 MEMGET high-water mark:     0.00 MB

*****************************************************
