**DIRAC
.PROPERTIES
**GENERAL
.RKBIMP
**GRID
.IMPORT
numerical_grid
**HAMILTONIAN
.URKBAL
.DFT
 LDA
.FDE
*FDE
.FRDENS
FROZEN
.RDFRMT
TXT
.UPDATE
.RSP
.LDPT
**INTEGRALS
.NUCMOD
1
*READIN
.UNCONTRACT
**WAVE FUNCTIONS
.SCF
*SCF
.EVCCNV
1.0E-08  1.0E-05
**PROPERTIES
.PRINT
2
.SHIELDING
*NMR
.LONDON
.SYMCON
*LINEAR RESPONSE
.PRINT
2
.THRESH
1.0E-07
.MAXITR
100
*END OF
