module gitlab.com/mirko.montolli/dataoutput

go 1.19

require (
	github.com/johnfercher/maroto v0.38.0
	github.com/jung-kurt/gofpdf v1.16.2
	github.com/xuri/excelize/v2 v2.6.1
)

require (
	github.com/boombuler/barcode v1.0.1 // indirect
	github.com/google/uuid v1.1.1 // indirect
	github.com/mohae/deepcopy v0.0.0-20170929034955-c48cc78d4826 // indirect
	github.com/richardlehane/mscfb v1.0.4 // indirect
	github.com/richardlehane/msoleps v1.0.3 // indirect
	github.com/ruudk/golang-pdf417 v0.0.0-20201230142125-a7e3863a1245 // indirect
	github.com/xuri/efp v0.0.0-20220603152613-6918739fd470 // indirect
	github.com/xuri/nfp v0.0.0-20220409054826-5e722a1d9e22 // indirect
	golang.org/x/crypto v0.0.0-20220817201139-bc19a97f63c8 // indirect
	golang.org/x/net v0.0.0-20220812174116-3211cb980234 // indirect
	golang.org/x/text v0.3.7 // indirect
)
