[
  {
    "id": "1693544266316",
    "username": "ff",
    "password": "$2b$10$mBZsoYKF9EAReraQa/aftOjrr/9waU9eKweQK55hPMCfhFoyDLWwa",
    "firstname": "ll",
    "lastname": "lll",
    "gender": "mk",
    "birthday": "2023-09-04T00:00:00.000Z",
    "role": "korisnik",
    "hasRentACarObject": false
  },
  {
    "id": "1693544862850",
    "username": "mirko",
    "password": "$2b$10$wQ3XPPfcmTJIDi58Y50PgOFFljDhPbfMecDENFvQWI5jMwR4beckO",
    "firstname": "mirko",
    "lastname": "mandic",
    "gender": "musko",
    "birthday": "2023-08-30T00:00:00.000Z",
    "role": "korisnik",
    "hasRentACarObject": false
  },
  {
    "id": "1693545096374",
    "username": "lolo",
    "password": "$2b$10$iM.1mgDs17I6H5mfbph.gONE4VWNoWN91Zrfy7uvUVZ7LJFzRxflS",
    "firstname": "mik",
    "lastname": "af",
    "gender": "dmf",
    "birthday": "2023-08-30T00:00:00.000Z",
    "role": "korisnik",
    "hasRentACarObject": false
  },
  {
    "id": "1693555593304",
    "username": "mirek",
    "password": "$2b$10$Sqs90JOiih.UClvhutAmDu2vy9lyX4sWqmLgP3G.s/4vxjyBSqcsu",
    "firstname": "John",
    "lastname": "Doe",
    "gender": "male",
    "birthday": "1990-01-15T00:00:00.000Z",
    "role": "korisnik",
    "hasRentACarObject": false
  },
  {
    "id": "1693555608006",
    "username": "mirek",
    "password": "testpassword",
    "firstname": "John",
    "lastname": "Doe",
    "gender": "male",
    "birthday": "1990-01-15T00:00:00.000Z",
    "role": "korisnik",
    "hasRentACarObject": false
  },
  {
    "id": "1693558825685",
    "username": "mirek",
    "password": "testpassword",
    "firstname": "John",
    "lastname": "Doe",
    "gender": "male",
    "birthday": "1990-01-15T00:00:00.000Z",
    "role": "korisnik",
    "hasRentACarObject": false
  },
  {
    "id": "1693559584670",
    "username": "mirek",
    "password": "testpassword",
    "firstname": "John",
    "lastname": "Doe",
    "gender": "male",
    "birthday": "1990-01-15T00:00:00.000Z",
    "role": "korisnik",
    "hasRentACarObject": false
  },
  {
    "id": "1693578424302",
    "username": "mirkan",
    "password": "$2b$10$L4duj.p/LigiuVhDnwp9a.OlxTvpfML1VFKyEZJeyNFjDlTchrN0K",
    "firstname": "mirko",
    "lastname": "mandic",
    "gender": "male",
    "birthday": "2023-08-29T00:00:00.000Z",
    "role": "admin",
    "hasRentACarObject": false
  }
]