%!PS-Adobe-3.0 EPSF-3.0
%%Creator: (MATLAB, The Mathworks, Inc. Version 9.0.0.341360 \(R2016a\). Operating System: Windows 8)
%%Title: D:/workspaces/nuplus-power-eff/figures/merged.eps
%%CreationDate: 2018-09-13T15:23:27
%%Pages: (atend)
%%BoundingBox: 0 0 1002 453
%%LanguageLevel: 3
%%EndComments
%%BeginProlog
%%BeginResource: procset (Apache XML Graphics Std ProcSet) 1.2 0
%%Version: 1.2 0
%%Copyright: (Copyright 2001-2003,2010 The Apache Software Foundation. License terms: http://www.apache.org/licenses/LICENSE-2.0)
/bd{bind def}bind def
/ld{load def}bd
/GR/grestore ld
/M/moveto ld
/LJ/setlinejoin ld
/C/curveto ld
/f/fill ld
/LW/setlinewidth ld
/GC/setgray ld
/t/show ld
/N/newpath ld
/CT/concat ld
/cp/closepath ld
/S/stroke ld
/L/lineto ld
/CC/setcmykcolor ld
/A/ashow ld
/GS/gsave ld
/RC/setrgbcolor ld
/RM/rmoveto ld
/ML/setmiterlimit ld
/re {4 2 roll M
1 index 0 rlineto
0 exch rlineto
neg 0 rlineto
cp } bd
/_ctm matrix def
/_tm matrix def
/BT { _ctm currentmatrix pop matrix _tm copy pop 0 0 moveto } bd
/ET { _ctm setmatrix } bd
/iTm { _ctm setmatrix _tm concat } bd
/Tm { _tm astore pop iTm 0 0 moveto } bd
/ux 0.0 def
/uy 0.0 def
/F {
  /Tp exch def
  /Tf exch def
  Tf findfont Tp scalefont setfont
  /cf Tf def  /cs Tp def
} bd
/ULS {currentpoint /uy exch def /ux exch def} bd
/ULE {
  /Tcx currentpoint pop def
  gsave
  newpath
  cf findfont cs scalefont dup
  /FontMatrix get 0 get /Ts exch def /FontInfo get dup
  /UnderlinePosition get Ts mul /To exch def
  /UnderlineThickness get Ts mul /Tt exch def
  ux uy To add moveto  Tcx uy To add lineto
  Tt setlinewidth stroke
  grestore
} bd
/OLE {
  /Tcx currentpoint pop def
  gsave
  newpath
  cf findfont cs scalefont dup
  /FontMatrix get 0 get /Ts exch def /FontInfo get dup
  /UnderlinePosition get Ts mul /To exch def
  /UnderlineThickness get Ts mul /Tt exch def
  ux uy To add cs add moveto Tcx uy To add cs add lineto
  Tt setlinewidth stroke
  grestore
} bd
/SOE {
  /Tcx currentpoint pop def
  gsave
  newpath
  cf findfont cs scalefont dup
  /FontMatrix get 0 get /Ts exch def /FontInfo get dup
  /UnderlinePosition get Ts mul /To exch def
  /UnderlineThickness get Ts mul /Tt exch def
  ux uy To add cs 10 mul 26 idiv add moveto Tcx uy To add cs 10 mul 26 idiv add lineto
  Tt setlinewidth stroke
  grestore
} bd
/QT {
/Y22 exch store
/X22 exch store
/Y21 exch store
/X21 exch store
currentpoint
/Y21 load 2 mul add 3 div exch
/X21 load 2 mul add 3 div exch
/X21 load 2 mul /X22 load add 3 div
/Y21 load 2 mul /Y22 load add 3 div
/X22 load /Y22 load curveto
} bd
/SSPD {
dup length /d exch dict def
{
/v exch def
/k exch def
currentpagedevice k known {
/cpdv currentpagedevice k get def
v cpdv ne {
/upd false def
/nullv v type /nulltype eq def
/nullcpdv cpdv type /nulltype eq def
nullv nullcpdv or
{
/upd true def
} {
/sametype v type cpdv type eq def
sametype {
v type /arraytype eq {
/vlen v length def
/cpdvlen cpdv length def
vlen cpdvlen eq {
0 1 vlen 1 sub {
/i exch def
/obj v i get def
/cpdobj cpdv i get def
obj cpdobj ne {
/upd true def
exit
} if
} for
} {
/upd true def
} ifelse
} {
v type /dicttype eq {
v {
/dv exch def
/dk exch def
/cpddv cpdv dk get def
dv cpddv ne {
/upd true def
exit
} if
} forall
} {
/upd true def
} ifelse
} ifelse
} if
} ifelse
upd true eq {
d k v put
} if
} if
} if
} forall
d length 0 gt {
d setpagedevice
} if
} bd
%%EndResource
%%BeginResource: procset (Apache XML Graphics EPS ProcSet) 1.0 0
%%Version: 1.0 0
%%Copyright: (Copyright 2002-2003 The Apache Software Foundation. License terms: http://www.apache.org/licenses/LICENSE-2.0)
/BeginEPSF { %def
/b4_Inc_state save def         % Save state for cleanup
/dict_count countdictstack def % Count objects on dict stack
/op_count count 1 sub def      % Count objects on operand stack
userdict begin                 % Push userdict on dict stack
/showpage { } def              % Redefine showpage, { } = null proc
0 setgray 0 setlinecap         % Prepare graphics state
1 setlinewidth 0 setlinejoin
10 setmiterlimit [ ] 0 setdash newpath
/languagelevel where           % If level not equal to 1 then
{pop languagelevel             % set strokeadjust and
1 ne                           % overprint to their defaults.
{false setstrokeadjust false setoverprint
} if
} if
} bd
/EndEPSF { %def
count op_count sub {pop} repeat            % Clean up stacks
countdictstack dict_count sub {end} repeat
b4_Inc_state restore
} bd
%%EndResource
%FOPBeginFontDict
%%IncludeResource: font Courier-Bold
%%IncludeResource: font Helvetica
%%IncludeResource: font Courier-BoldOblique
%%IncludeResource: font Courier-Oblique
%%IncludeResource: font Times-Roman
%%IncludeResource: font Helvetica-BoldOblique
%%IncludeResource: font Helvetica-Bold
%%IncludeResource: font Helvetica-Oblique
%%IncludeResource: font Times-BoldItalic
%%IncludeResource: font Courier
%%IncludeResource: font Times-Italic
%%IncludeResource: font Times-Bold
%%IncludeResource: font Symbol
%%IncludeResource: font ZapfDingbats
%FOPEndFontDict
%%BeginResource: encoding WinAnsiEncoding
/WinAnsiEncoding [
/.notdef /.notdef /.notdef /.notdef /.notdef
/.notdef /.notdef /.notdef /.notdef /.notdef
/.notdef /.notdef /.notdef /.notdef /.notdef
/.notdef /.notdef /.notdef /.notdef /.notdef
/.notdef /.notdef /.notdef /.notdef /.notdef
/.notdef /.notdef /.notdef /.notdef /.notdef
/.notdef /.notdef /space /exclam /quotedbl
/numbersign /dollar /percent /ampersand /quotesingle
/parenleft /parenright /asterisk /plus /comma
/hyphen /period /slash /zero /one
/two /three /four /five /six
/seven /eight /nine /colon /semicolon
/less /equal /greater /question /at
/A /B /C /D /E
/F /G /H /I /J
/K /L /M /N /O
/P /Q /R /S /T
/U /V /W /X /Y
/Z /bracketleft /backslash /bracketright /asciicircum
/underscore /quoteleft /a /b /c
/d /e /f /g /h
/i /j /k /l /m
/n /o /p /q /r
/s /t /u /v /w
/x /y /z /braceleft /bar
/braceright /asciitilde /bullet /Euro /bullet
/quotesinglbase /florin /quotedblbase /ellipsis /dagger
/daggerdbl /circumflex /perthousand /Scaron /guilsinglleft
/OE /bullet /Zcaron /bullet /bullet
/quoteleft /quoteright /quotedblleft /quotedblright /bullet
/endash /emdash /asciitilde /trademark /scaron
/guilsinglright /oe /bullet /zcaron /Ydieresis
/space /exclamdown /cent /sterling /currency
/yen /brokenbar /section /dieresis /copyright
/ordfeminine /guillemotleft /logicalnot /sfthyphen /registered
/macron /degree /plusminus /twosuperior /threesuperior
/acute /mu /paragraph /middot /cedilla
/onesuperior /ordmasculine /guillemotright /onequarter /onehalf
/threequarters /questiondown /Agrave /Aacute /Acircumflex
/Atilde /Adieresis /Aring /AE /Ccedilla
/Egrave /Eacute /Ecircumflex /Edieresis /Igrave
/Iacute /Icircumflex /Idieresis /Eth /Ntilde
/Ograve /Oacute /Ocircumflex /Otilde /Odieresis
/multiply /Oslash /Ugrave /Uacute /Ucircumflex
/Udieresis /Yacute /Thorn /germandbls /agrave
/aacute /acircumflex /atilde /adieresis /aring
/ae /ccedilla /egrave /eacute /ecircumflex
/edieresis /igrave /iacute /icircumflex /idieresis
/eth /ntilde /ograve /oacute /ocircumflex
/otilde /odieresis /divide /oslash /ugrave
/uacute /ucircumflex /udieresis /yacute /thorn
/ydieresis
] def
%%EndResource
%FOPBeginFontReencode
/Courier-Bold findfont
dup length dict begin
  {1 index /FID ne {def} {pop pop} ifelse} forall
  /Encoding WinAnsiEncoding def
  currentdict
end
/Courier-Bold exch definefont pop
/Helvetica findfont
dup length dict begin
  {1 index /FID ne {def} {pop pop} ifelse} forall
  /Encoding WinAnsiEncoding def
  currentdict
end
/Helvetica exch definefont pop
/Courier-BoldOblique findfont
dup length dict begin
  {1 index /FID ne {def} {pop pop} ifelse} forall
  /Encoding WinAnsiEncoding def
  currentdict
end
/Courier-BoldOblique exch definefont pop
/Courier-Oblique findfont
dup length dict begin
  {1 index /FID ne {def} {pop pop} ifelse} forall
  /Encoding WinAnsiEncoding def
  currentdict
end
/Courier-Oblique exch definefont pop
/Times-Roman findfont
dup length dict begin
  {1 index /FID ne {def} {pop pop} ifelse} forall
  /Encoding WinAnsiEncoding def
  currentdict
end
/Times-Roman exch definefont pop
/Helvetica-BoldOblique findfont
dup length dict begin
  {1 index /FID ne {def} {pop pop} ifelse} forall
  /Encoding WinAnsiEncoding def
  currentdict
end
/Helvetica-BoldOblique exch definefont pop
/Helvetica-Bold findfont
dup length dict begin
  {1 index /FID ne {def} {pop pop} ifelse} forall
  /Encoding WinAnsiEncoding def
  currentdict
end
/Helvetica-Bold exch definefont pop
/Helvetica-Oblique findfont
dup length dict begin
  {1 index /FID ne {def} {pop pop} ifelse} forall
  /Encoding WinAnsiEncoding def
  currentdict
end
/Helvetica-Oblique exch definefont pop
/Times-BoldItalic findfont
dup length dict begin
  {1 index /FID ne {def} {pop pop} ifelse} forall
  /Encoding WinAnsiEncoding def
  currentdict
end
/Times-BoldItalic exch definefont pop
/Courier findfont
dup length dict begin
  {1 index /FID ne {def} {pop pop} ifelse} forall
  /Encoding WinAnsiEncoding def
  currentdict
end
/Courier exch definefont pop
/Times-Italic findfont
dup length dict begin
  {1 index /FID ne {def} {pop pop} ifelse} forall
  /Encoding WinAnsiEncoding def
  currentdict
end
/Times-Italic exch definefont pop
/Times-Bold findfont
dup length dict begin
  {1 index /FID ne {def} {pop pop} ifelse} forall
  /Encoding WinAnsiEncoding def
  currentdict
end
/Times-Bold exch definefont pop
%FOPEndFontReencode
%%EndProlog
%%Page: 1 1
%%PageBoundingBox: 0 0 1002 453
%%BeginPageSetup
[1 0 0 -1 0 453] CT
%%EndPageSetup
GS
[0.75 0 0 0.75 0 0] CT
1 GC
N
0 0 1336 604 re
f
GR
GS
[0.75 0 0 0.75 0 0] CT
1 GC
N
0 0 1336 604 re
f
GR
GS
[0.75 0 0 0.75 0 0] CT
1 GC
N
121 543 M
359 543 L
359 347 L
121 347 L
cp
f
GR
GS
[0.75 0 0 0.75 0 0] CT
0.873 GC
1 LJ
0.667 LW
N
135 543 M
135 347 L
S
GR
GS
[0.75 0 0 0.75 0 0] CT
0.873 GC
1 LJ
0.667 LW
N
163 543 M
163 347 L
S
GR
GS
[0.75 0 0 0.75 0 0] CT
0.873 GC
1 LJ
0.667 LW
N
191 543 M
191 347 L
S
GR
GS
[0.75 0 0 0.75 0 0] CT
0.873 GC
1 LJ
0.667 LW
N
219 543 M
219 347 L
S
GR
GS
[0.75 0 0 0.75 0 0] CT
0.873 GC
1 LJ
0.667 LW
N
247 543 M
247 347 L
S
GR
GS
[0.75 0 0 0.75 0 0] CT
0.873 GC
1 LJ
0.667 LW
N
275 543 M
275 347 L
S
GR
GS
[0.75 0 0 0.75 0 0] CT
0.873 GC
1 LJ
0.667 LW
N
303 543 M
303 347 L
S
GR
GS
[0.75 0 0 0.75 0 0] CT
0.873 GC
1 LJ
0.667 LW
N
331 543 M
331 347 L
S
GR
GS
[0.75 0 0 0.75 0 0] CT
0.873 GC
1 LJ
0.667 LW
N
359 543 M
121 543 L
S
GR
GS
[0.75 0 0 0.75 0 0] CT
0.873 GC
1 LJ
0.667 LW
N
359 510.333 M
121 510.333 L
S
GR
GS
[0.75 0 0 0.75 0 0] CT
0.873 GC
1 LJ
0.667 LW
N
359 477.667 M
121 477.667 L
S
GR
GS
[0.75 0 0 0.75 0 0] CT
0.873 GC
1 LJ
0.667 LW
N
359 445 M
121 445 L
S
GR
GS
[0.75 0 0 0.75 0 0] CT
0.873 GC
1 LJ
0.667 LW
N
359 412.333 M
121 412.333 L
S
GR
GS
[0.75 0 0 0.75 0 0] CT
0.873 GC
1 LJ
0.667 LW
N
359 379.667 M
121 379.667 L
S
GR
GS
[0.75 0 0 0.75 0 0] CT
0.873 GC
1 LJ
0.667 LW
N
359 347 M
121 347 L
S
GR
GS
[0.75 0 0 0.75 0 0] CT
0.149 GC
2 setlinecap
1 LJ
0.667 LW
N
121 543 M
359 543 L
S
GR
GS
[0.75 0 0 0.75 0 0] CT
0.149 GC
2 setlinecap
1 LJ
0.667 LW
N
121 347 M
359 347 L
S
GR
GS
[0.75 0 0 0.75 0 0] CT
0.149 GC
2 setlinecap
1 LJ
0.667 LW
N
135 543 M
135 540.62 L
S
GR
GS
[0.75 0 0 0.75 0 0] CT
0.149 GC
2 setlinecap
1 LJ
0.667 LW
N
163 543 M
163 540.62 L
S
GR
GS
[0.75 0 0 0.75 0 0] CT
0.149 GC
2 setlinecap
1 LJ
0.667 LW
N
191 543 M
191 540.62 L
S
GR
GS
[0.75 0 0 0.75 0 0] CT
0.149 GC
2 setlinecap
1 LJ
0.667 LW
N
219 543 M
219 540.62 L
S
GR
GS
[0.75 0 0 0.75 0 0] CT
0.149 GC
2 setlinecap
1 LJ
0.667 LW
N
247 543 M
247 540.62 L
S
GR
GS
[0.75 0 0 0.75 0 0] CT
0.149 GC
2 setlinecap
1 LJ
0.667 LW
N
275 543 M
275 540.62 L
S
GR
GS
[0.75 0 0 0.75 0 0] CT
0.149 GC
2 setlinecap
1 LJ
0.667 LW
N
303 543 M
303 540.62 L
S
GR
GS
[0.75 0 0 0.75 0 0] CT
0.149 GC
2 setlinecap
1 LJ
0.667 LW
N
331 543 M
331 540.62 L
S
GR
GS
[0.75 0 0 0.75 0 0] CT
0.149 GC
2 setlinecap
1 LJ
0.667 LW
N
135 347 M
135 349.38 L
S
GR
GS
[0.75 0 0 0.75 0 0] CT
0.149 GC
2 setlinecap
1 LJ
0.667 LW
N
163 347 M
163 349.38 L
S
GR
GS
[0.75 0 0 0.75 0 0] CT
0.149 GC
2 setlinecap
1 LJ
0.667 LW
N
191 347 M
191 349.38 L
S
GR
GS
[0.75 0 0 0.75 0 0] CT
0.149 GC
2 setlinecap
1 LJ
0.667 LW
N
219 347 M
219 349.38 L
S
GR
GS
[0.75 0 0 0.75 0 0] CT
0.149 GC
2 setlinecap
1 LJ
0.667 LW
N
247 347 M
247 349.38 L
S
GR
GS
[0.75 0 0 0.75 0 0] CT
0.149 GC
2 setlinecap
1 LJ
0.667 LW
N
275 347 M
275 349.38 L
S
GR
GS
[0.75 0 0 0.75 0 0] CT
0.149 GC
2 setlinecap
1 LJ
0.667 LW
N
303 347 M
303 349.38 L
S
GR
GS
[0.75 0 0 0.75 0 0] CT
0.149 GC
2 setlinecap
1 LJ
0.667 LW
N
331 347 M
331 349.38 L
S
GR
GS
[0.53033 -0.53033 0.53033 0.53033 101.25 411.24998] CT
0.149 GC
/Helvetica 13.333 F
GS
[1 0 0 1 0 0] CT
-28 14 moveto 
1 -1 scale
(conv) t 
GR
GR
GS
[0.53033 -0.53033 0.53033 0.53033 122.25 411.24998] CT
0.149 GC
/Helvetica 13.333 F
GS
[1 0 0 1 0 0] CT
-18 14 moveto 
1 -1 scale
(dct) t 
GR
GR
GS
[0.53033 -0.53033 0.53033 0.53033 143.25 411.24998] CT
0.149 GC
/Helvetica 13.333 F
GS
[1 0 0 1 0 0] CT
-11 14 moveto 
1 -1 scale
(fft) t 
GR
GR
GS
[0.53033 -0.53033 0.53033 0.53033 164.25 411.24998] CT
0.149 GC
/Helvetica 13.333 F
GS
[1 0 0 1 0 0] CT
-18 14 moveto 
1 -1 scale
(lud) t 
GR
GR
GS
[0.53033 -0.53033 0.53033 0.53033 185.25 411.24998] CT
0.149 GC
/Helvetica 13.333 F
GS
[1 0 0 1 0 0] CT
-18 14 moveto 
1 -1 scale
(ms) t 
GR
GR
GS
[0.53033 -0.53033 0.53033 0.53033 206.25 411.24998] CT
0.149 GC
/Helvetica 13.333 F
GS
[1 0 0 1 0 0] CT
-15 14 moveto 
1 -1 scale
(mt) t 
GR
GR
GS
[0.53033 -0.53033 0.53033 0.53033 227.25 411.24998] CT
0.149 GC
/Helvetica 13.333 F
GS
[1 0 0 1 0 0] CT
-22 14 moveto 
1 -1 scale
(mm) t 
GR
GR
GS
[0.53033 -0.53033 0.53033 0.53033 248.25 411.24998] CT
0.149 GC
/Helvetica 13.333 F
GS
[1 0 0 1 0 0] CT
-46 14 moveto 
1 -1 scale
(kmeans) t 
GR
GR
GS
[0.75 0 0 0.75 0 0] CT
0.149 GC
2 setlinecap
1 LJ
0.667 LW
N
121 543 M
121 347 L
S
GR
GS
[0.75 0 0 0.75 0 0] CT
0.149 GC
2 setlinecap
1 LJ
0.667 LW
N
359 543 M
359 347 L
S
GR
GS
[0.75 0 0 0.75 0 0] CT
0.149 GC
2 setlinecap
1 LJ
0.667 LW
N
121 543 M
123.38 543 L
S
GR
GS
[0.75 0 0 0.75 0 0] CT
0.149 GC
2 setlinecap
1 LJ
0.667 LW
N
121 510.333 M
123.38 510.333 L
S
GR
GS
[0.75 0 0 0.75 0 0] CT
0.149 GC
2 setlinecap
1 LJ
0.667 LW
N
121 477.667 M
123.38 477.667 L
S
GR
GS
[0.75 0 0 0.75 0 0] CT
0.149 GC
2 setlinecap
1 LJ
0.667 LW
N
121 445 M
123.38 445 L
S
GR
GS
[0.75 0 0 0.75 0 0] CT
0.149 GC
2 setlinecap
1 LJ
0.667 LW
N
121 412.333 M
123.38 412.333 L
S
GR
GS
[0.75 0 0 0.75 0 0] CT
0.149 GC
2 setlinecap
1 LJ
0.667 LW
N
121 379.667 M
123.38 379.667 L
S
GR
GS
[0.75 0 0 0.75 0 0] CT
0.149 GC
2 setlinecap
1 LJ
0.667 LW
N
121 347 M
123.38 347 L
S
GR
GS
[0.75 0 0 0.75 0 0] CT
0.149 GC
2 setlinecap
1 LJ
0.667 LW
N
359 543 M
356.62 543 L
S
GR
GS
[0.75 0 0 0.75 0 0] CT
0.149 GC
2 setlinecap
1 LJ
0.667 LW
N
359 510.333 M
356.62 510.333 L
S
GR
GS
[0.75 0 0 0.75 0 0] CT
0.149 GC
2 setlinecap
1 LJ
0.667 LW
N
359 477.667 M
356.62 477.667 L
S
GR
GS
[0.75 0 0 0.75 0 0] CT
0.149 GC
2 setlinecap
1 LJ
0.667 LW
N
359 445 M
356.62 445 L
S
GR
GS
[0.75 0 0 0.75 0 0] CT
0.149 GC
2 setlinecap
1 LJ
0.667 LW
N
359 412.333 M
356.62 412.333 L
S
GR
GS
[0.75 0 0 0.75 0 0] CT
0.149 GC
2 setlinecap
1 LJ
0.667 LW
N
359 379.667 M
356.62 379.667 L
S
GR
GS
[0.75 0 0 0.75 0 0] CT
0.149 GC
2 setlinecap
1 LJ
0.667 LW
N
359 347 M
356.62 347 L
S
GR
GS
[0.75 0 0 0.75 86.75 407.25] CT
0.149 GC
/Helvetica 13.333 F
GS
[1 0 0 1 0 0] CT
-8 5.5 moveto 
1 -1 scale
(0) t 
GR
GR
GS
[0.75 0 0 0.75 86.75 382.75001] CT
0.149 GC
/Helvetica 13.333 F
GS
[1 0 0 1 0 0] CT
-19 5.5 moveto 
1 -1 scale
(0.2) t 
GR
GR
GS
[0.75 0 0 0.75 86.75 358.24999] CT
0.149 GC
/Helvetica 13.333 F
GS
[1 0 0 1 0 0] CT
-19 5.5 moveto 
1 -1 scale
(0.4) t 
GR
GR
GS
[0.75 0 0 0.75 86.75 333.75] CT
0.149 GC
/Helvetica 13.333 F
GS
[1 0 0 1 0 0] CT
-19 5.5 moveto 
1 -1 scale
(0.6) t 
GR
GR
GS
[0.75 0 0 0.75 86.75 309.25001] CT
0.149 GC
/Helvetica 13.333 F
GS
[1 0 0 1 0 0] CT
-19 5.5 moveto 
1 -1 scale
(0.8) t 
GR
GR
GS
[0.75 0 0 0.75 86.75 284.74999] CT
0.149 GC
/Helvetica 13.333 F
GS
[1 0 0 1 0 0] CT
-8 5.5 moveto 
1 -1 scale
(1) t 
GR
GR
GS
[0.75 0 0 0.75 86.75 260.25] CT
0.149 GC
/Helvetica 13.333 F
GS
[1 0 0 1 0 0] CT
-19 5.5 moveto 
1 -1 scale
(1.2) t 
GR
GR
GS
[0 -0.75 0.75 0 69.5 333.74993] CT
0.149 GC
/Helvetica 13.333 F
GS
[1 0 0 1 0 0] CT
-39 -3 moveto 
1 -1 scale
(Kernel cycles) t 
GR
GR
GS
[0.75 0 0 0.75 0 0] CT
0.149 GC
1 LJ
0.667 LW
N
121 543 M
359 543 L
S
GR
GS
[0.75 0 0 0.75 0 0] CT
0.208 0.165 0.525 RC
N
127.8 543 M
134.2 543 L
134.2 379.667 L
127.8 379.667 L
cp
f
GR
GS
[0.75 0 0 0.75 0 0] CT
0.208 0.165 0.525 RC
N
155.8 543 M
162.2 543 L
162.2 379.667 L
155.8 379.667 L
cp
f
GR
GS
[0.75 0 0 0.75 0 0] CT
0.208 0.165 0.525 RC
N
183.8 543 M
190.2 543 L
190.2 379.667 L
183.8 379.667 L
cp
f
GR
GS
[0.75 0 0 0.75 0 0] CT
0.208 0.165 0.525 RC
N
211.8 543 M
218.2 543 L
218.2 379.667 L
211.8 379.667 L
cp
f
GR
GS
[0.75 0 0 0.75 0 0] CT
0.208 0.165 0.525 RC
N
239.8 543 M
246.2 543 L
246.2 379.667 L
239.8 379.667 L
cp
f
GR
GS
[0.75 0 0 0.75 0 0] CT
0.208 0.165 0.525 RC
N
267.8 543 M
274.2 543 L
274.2 379.667 L
267.8 379.667 L
cp
f
GR
GS
[0.75 0 0 0.75 0 0] CT
0.208 0.165 0.525 RC
N
295.8 543 M
302.2 543 L
302.2 379.667 L
295.8 379.667 L
cp
f
GR
GS
[0.75 0 0 0.75 0 0] CT
0.208 0.165 0.525 RC
N
323.8 543 M
330.2 543 L
330.2 379.667 L
323.8 379.667 L
cp
f
GR
GS
[0.75 0 0 0.75 0 0] CT
10.0 ML
0.667 LW
N
127.8 543 M
127.8 379.667 L
134.2 379.667 L
134.2 543 L
cp
S
GR
GS
[0.75 0 0 0.75 0 0] CT
10.0 ML
0.667 LW
N
155.8 543 M
155.8 379.667 L
162.2 379.667 L
162.2 543 L
cp
S
GR
GS
[0.75 0 0 0.75 0 0] CT
10.0 ML
0.667 LW
N
183.8 543 M
183.8 379.667 L
190.2 379.667 L
190.2 543 L
cp
S
GR
GS
[0.75 0 0 0.75 0 0] CT
10.0 ML
0.667 LW
N
211.8 543 M
211.8 379.667 L
218.2 379.667 L
218.2 543 L
cp
S
GR
GS
[0.75 0 0 0.75 0 0] CT
10.0 ML
0.667 LW
N
239.8 543 M
239.8 379.667 L
246.2 379.667 L
246.2 543 L
cp
S
GR
GS
[0.75 0 0 0.75 0 0] CT
10.0 ML
0.667 LW
N
267.8 543 M
267.8 379.667 L
274.2 379.667 L
274.2 543 L
cp
S
GR
GS
[0.75 0 0 0.75 0 0] CT
10.0 ML
0.667 LW
N
295.8 543 M
295.8 379.667 L
302.2 379.667 L
302.2 543 L
cp
S
GR
GS
[0.75 0 0 0.75 0 0] CT
10.0 ML
0.667 LW
N
323.8 543 M
323.8 379.667 L
330.2 379.667 L
330.2 543 L
cp
S
GR
GS
[0.75 0 0 0.75 0 0] CT
0.973 0.98 0.051 RC
N
135.8 543 M
142.2 543 L
142.2 380.484 L
135.8 380.484 L
cp
f
GR
GS
[0.75 0 0 0.75 0 0] CT
0.973 0.98 0.051 RC
N
163.8 543 M
170.2 543 L
170.2 388.445 L
163.8 388.445 L
cp
f
GR
GS
[0.75 0 0 0.75 0 0] CT
0.973 0.98 0.051 RC
N
191.8 543 M
198.2 543 L
198.2 379.186 L
191.8 379.186 L
cp
f
GR
GS
[0.75 0 0 0.75 0 0] CT
0.973 0.98 0.051 RC
N
219.8 543 M
226.2 543 L
226.2 386.828 L
219.8 386.828 L
cp
f
GR
GS
[0.75 0 0 0.75 0 0] CT
0.973 0.98 0.051 RC
N
247.8 543 M
254.2 543 L
254.2 379.545 L
247.8 379.545 L
cp
f
GR
GS
[0.75 0 0 0.75 0 0] CT
0.973 0.98 0.051 RC
N
275.8 543 M
282.2 543 L
282.2 419.802 L
275.8 419.802 L
cp
f
GR
GS
[0.75 0 0 0.75 0 0] CT
0.973 0.98 0.051 RC
N
303.8 543 M
310.2 543 L
310.2 388.778 L
303.8 388.778 L
cp
f
GR
GS
[0.75 0 0 0.75 0 0] CT
0.973 0.98 0.051 RC
N
331.8 543 M
338.2 543 L
338.2 412.599 L
331.8 412.599 L
cp
f
GR
GS
[0.75 0 0 0.75 0 0] CT
10.0 ML
0.667 LW
N
135.8 543 M
135.8 380.484 L
142.2 380.484 L
142.2 543 L
cp
S
GR
GS
[0.75 0 0 0.75 0 0] CT
10.0 ML
0.667 LW
N
163.8 543 M
163.8 388.445 L
170.2 388.445 L
170.2 543 L
cp
S
GR
GS
[0.75 0 0 0.75 0 0] CT
10.0 ML
0.667 LW
N
191.8 543 M
191.8 379.186 L
198.2 379.186 L
198.2 543 L
cp
S
GR
GS
[0.75 0 0 0.75 0 0] CT
10.0 ML
0.667 LW
N
219.8 543 M
219.8 386.828 L
226.2 386.828 L
226.2 543 L
cp
S
GR
GS
[0.75 0 0 0.75 0 0] CT
10.0 ML
0.667 LW
N
247.8 543 M
247.8 379.545 L
254.2 379.545 L
254.2 543 L
cp
S
GR
GS
[0.75 0 0 0.75 0 0] CT
10.0 ML
0.667 LW
N
275.8 543 M
275.8 419.802 L
282.2 419.802 L
282.2 543 L
cp
S
GR
GS
[0.75 0 0 0.75 0 0] CT
10.0 ML
0.667 LW
N
303.8 543 M
303.8 388.778 L
310.2 388.778 L
310.2 543 L
cp
S
GR
GS
[0.75 0 0 0.75 0 0] CT
10.0 ML
0.667 LW
N
331.8 543 M
331.8 412.599 L
338.2 412.599 L
338.2 543 L
cp
S
GR
GS
[0.75 0 0 0.75 0 0] CT
1 GC
N
238 366 M
238 330 L
354 330 L
354 366 L
cp
f
GR
GS
[0.75 0 0 0.75 206.01283 254.89725] CT
/Helvetica 12 F
GS
[1 0 0 1 0 0] CT
0 5 moveto 
1 -1 scale
(Coherent) t 
GR
GR
GS
[0.75 0 0 0.75 0 0] CT
0.208 0.165 0.525 RC
N
241.966 345.929 M
241.966 333.797 L
271.709 333.797 L
271.709 345.929 L
cp
f
GR
GS
[0.75 0 0 0.75 0 0] CT
10.0 ML
0.667 LW
N
241.966 345.929 M
241.966 333.797 L
271.709 333.797 L
271.709 345.929 L
cp
S
GR
GS
[0.75 0 0 0.75 206.01283 267.10275] CT
/Helvetica 12 F
GS
[1 0 0 1 0 0] CT
0 5 moveto 
1 -1 scale
(Non-Coherent) t 
GR
GR
GS
[0.75 0 0 0.75 0 0] CT
0.973 0.98 0.051 RC
N
241.966 362.203 M
241.966 350.071 L
271.709 350.071 L
271.709 362.203 L
cp
f
GR
GS
[0.75 0 0 0.75 0 0] CT
10.0 ML
0.667 LW
N
241.966 362.203 M
241.966 350.071 L
271.709 350.071 L
271.709 362.203 L
cp
S
GR
GS
[0.75 0 0 0.75 0 0] CT
0.149 GC
10.0 ML
0.667 LW
N
238 366 M
238 330 L
354 330 L
354 366 L
cp
S
GR
GS
[0.75 0 0 0.75 0 0] CT
1 GC
N
422 543 M
657 543 L
657 347 L
422 347 L
cp
f
GR
GS
[0.75 0 0 0.75 0 0] CT
0.873 GC
1 LJ
0.667 LW
N
435.824 543 M
435.824 347 L
S
GR
GS
[0.75 0 0 0.75 0 0] CT
0.873 GC
1 LJ
0.667 LW
N
463.471 543 M
463.471 347 L
S
GR
GS
[0.75 0 0 0.75 0 0] CT
0.873 GC
1 LJ
0.667 LW
N
491.118 543 M
491.118 347 L
S
GR
GS
[0.75 0 0 0.75 0 0] CT
0.873 GC
1 LJ
0.667 LW
N
518.765 543 M
518.765 347 L
S
GR
GS
[0.75 0 0 0.75 0 0] CT
0.873 GC
1 LJ
0.667 LW
N
546.412 543 M
546.412 347 L
S
GR
GS
[0.75 0 0 0.75 0 0] CT
0.873 GC
1 LJ
0.667 LW
N
574.059 543 M
574.059 347 L
S
GR
GS
[0.75 0 0 0.75 0 0] CT
0.873 GC
1 LJ
0.667 LW
N
601.706 543 M
601.706 347 L
S
GR
GS
[0.75 0 0 0.75 0 0] CT
0.873 GC
1 LJ
0.667 LW
N
629.353 543 M
629.353 347 L
S
GR
GS
[0.75 0 0 0.75 0 0] CT
0.873 GC
1 LJ
0.667 LW
N
657 543 M
422 543 L
S
GR
GS
[0.75 0 0 0.75 0 0] CT
0.873 GC
1 LJ
0.667 LW
N
657 510.333 M
422 510.333 L
S
GR
GS
[0.75 0 0 0.75 0 0] CT
0.873 GC
1 LJ
0.667 LW
N
657 477.667 M
422 477.667 L
S
GR
GS
[0.75 0 0 0.75 0 0] CT
0.873 GC
1 LJ
0.667 LW
N
657 445 M
422 445 L
S
GR
GS
[0.75 0 0 0.75 0 0] CT
0.873 GC
1 LJ
0.667 LW
N
657 412.333 M
422 412.333 L
S
GR
GS
[0.75 0 0 0.75 0 0] CT
0.873 GC
1 LJ
0.667 LW
N
657 379.667 M
422 379.667 L
S
GR
GS
[0.75 0 0 0.75 0 0] CT
0.873 GC
1 LJ
0.667 LW
N
657 347 M
422 347 L
S
GR
GS
[0.75 0 0 0.75 0 0] CT
0.149 GC
2 setlinecap
1 LJ
0.667 LW
N
422 543 M
657 543 L
S
GR
GS
[0.75 0 0 0.75 0 0] CT
0.149 GC
2 setlinecap
1 LJ
0.667 LW
N
422 347 M
657 347 L
S
GR
GS
[0.75 0 0 0.75 0 0] CT
0.149 GC
2 setlinecap
1 LJ
0.667 LW
N
435.824 543 M
435.824 540.65 L
S
GR
GS
[0.75 0 0 0.75 0 0] CT
0.149 GC
2 setlinecap
1 LJ
0.667 LW
N
463.471 543 M
463.471 540.65 L
S
GR
GS
[0.75 0 0 0.75 0 0] CT
0.149 GC
2 setlinecap
1 LJ
0.667 LW
N
491.118 543 M
491.118 540.65 L
S
GR
GS
[0.75 0 0 0.75 0 0] CT
0.149 GC
2 setlinecap
1 LJ
0.667 LW
N
518.765 543 M
518.765 540.65 L
S
GR
GS
[0.75 0 0 0.75 0 0] CT
0.149 GC
2 setlinecap
1 LJ
0.667 LW
N
546.412 543 M
546.412 540.65 L
S
GR
GS
[0.75 0 0 0.75 0 0] CT
0.149 GC
2 setlinecap
1 LJ
0.667 LW
N
574.059 543 M
574.059 540.65 L
S
GR
GS
[0.75 0 0 0.75 0 0] CT
0.149 GC
2 setlinecap
1 LJ
0.667 LW
N
601.706 543 M
601.706 540.65 L
S
GR
GS
[0.75 0 0 0.75 0 0] CT
0.149 GC
2 setlinecap
1 LJ
0.667 LW
N
629.353 543 M
629.353 540.65 L
S
GR
GS
[0.75 0 0 0.75 0 0] CT
0.149 GC
2 setlinecap
1 LJ
0.667 LW
N
435.824 347 M
435.824 349.35 L
S
GR
GS
[0.75 0 0 0.75 0 0] CT
0.149 GC
2 setlinecap
1 LJ
0.667 LW
N
463.471 347 M
463.471 349.35 L
S
GR
GS
[0.75 0 0 0.75 0 0] CT
0.149 GC
2 setlinecap
1 LJ
0.667 LW
N
491.118 347 M
491.118 349.35 L
S
GR
GS
[0.75 0 0 0.75 0 0] CT
0.149 GC
2 setlinecap
1 LJ
0.667 LW
N
518.765 347 M
518.765 349.35 L
S
GR
GS
[0.75 0 0 0.75 0 0] CT
0.149 GC
2 setlinecap
1 LJ
0.667 LW
N
546.412 347 M
546.412 349.35 L
S
GR
GS
[0.75 0 0 0.75 0 0] CT
0.149 GC
2 setlinecap
1 LJ
0.667 LW
N
574.059 347 M
574.059 349.35 L
S
GR
GS
[0.75 0 0 0.75 0 0] CT
0.149 GC
2 setlinecap
1 LJ
0.667 LW
N
601.706 347 M
601.706 349.35 L
S
GR
GS
[0.75 0 0 0.75 0 0] CT
0.149 GC
2 setlinecap
1 LJ
0.667 LW
N
629.353 347 M
629.353 349.35 L
S
GR
GS
[0.53033 -0.53033 0.53033 0.53033 326.86764 411.24998] CT
0.149 GC
/Helvetica 13.333 F
GS
[1 0 0 1 0 0] CT
-28 14 moveto 
1 -1 scale
(conv) t 
GR
GR
GS
[0.53033 -0.53033 0.53033 0.53033 347.60294 411.24998] CT
0.149 GC
/Helvetica 13.333 F
GS
[1 0 0 1 0 0] CT
-18 14 moveto 
1 -1 scale
(dct) t 
GR
GR
GS
[0.53033 -0.53033 0.53033 0.53033 368.33823 411.24998] CT
0.149 GC
/Helvetica 13.333 F
GS
[1 0 0 1 0 0] CT
-11 14 moveto 
1 -1 scale
(fft) t 
GR
GR
GS
[0.53033 -0.53033 0.53033 0.53033 389.07353 411.24998] CT
0.149 GC
/Helvetica 13.333 F
GS
[1 0 0 1 0 0] CT
-18 14 moveto 
1 -1 scale
(lud) t 
GR
GR
GS
[0.53033 -0.53033 0.53033 0.53033 409.80881 411.24998] CT
0.149 GC
/Helvetica 13.333 F
GS
[1 0 0 1 0 0] CT
-18 14 moveto 
1 -1 scale
(ms) t 
GR
GR
GS
[0.53033 -0.53033 0.53033 0.53033 430.54413 411.24998] CT
0.149 GC
/Helvetica 13.333 F
GS
[1 0 0 1 0 0] CT
-15 14 moveto 
1 -1 scale
(mt) t 
GR
GR
GS
[0.53033 -0.53033 0.53033 0.53033 451.2794 411.24998] CT
0.149 GC
/Helvetica 13.333 F
GS
[1 0 0 1 0 0] CT
-22 14 moveto 
1 -1 scale
(mm) t 
GR
GR
GS
[0.53033 -0.53033 0.53033 0.53033 472.01472 411.24998] CT
0.149 GC
/Helvetica 13.333 F
GS
[1 0 0 1 0 0] CT
-46 14 moveto 
1 -1 scale
(kmeans) t 
GR
GR
GS
[0.75 0 0 0.75 0 0] CT
0.149 GC
2 setlinecap
1 LJ
0.667 LW
N
422 543 M
422 347 L
S
GR
GS
[0.75 0 0 0.75 0 0] CT
0.149 GC
2 setlinecap
1 LJ
0.667 LW
N
657 543 M
657 347 L
S
GR
GS
[0.75 0 0 0.75 0 0] CT
0.149 GC
2 setlinecap
1 LJ
0.667 LW
N
422 543 M
424.35 543 L
S
GR
GS
[0.75 0 0 0.75 0 0] CT
0.149 GC
2 setlinecap
1 LJ
0.667 LW
N
422 510.333 M
424.35 510.333 L
S
GR
GS
[0.75 0 0 0.75 0 0] CT
0.149 GC
2 setlinecap
1 LJ
0.667 LW
N
422 477.667 M
424.35 477.667 L
S
GR
GS
[0.75 0 0 0.75 0 0] CT
0.149 GC
2 setlinecap
1 LJ
0.667 LW
N
422 445 M
424.35 445 L
S
GR
GS
[0.75 0 0 0.75 0 0] CT
0.149 GC
2 setlinecap
1 LJ
0.667 LW
N
422 412.333 M
424.35 412.333 L
S
GR
GS
[0.75 0 0 0.75 0 0] CT
0.149 GC
2 setlinecap
1 LJ
0.667 LW
N
422 379.667 M
424.35 379.667 L
S
GR
GS
[0.75 0 0 0.75 0 0] CT
0.149 GC
2 setlinecap
1 LJ
0.667 LW
N
422 347 M
424.35 347 L
S
GR
GS
[0.75 0 0 0.75 0 0] CT
0.149 GC
2 setlinecap
1 LJ
0.667 LW
N
657 543 M
654.65 543 L
S
GR
GS
[0.75 0 0 0.75 0 0] CT
0.149 GC
2 setlinecap
1 LJ
0.667 LW
N
657 510.333 M
654.65 510.333 L
S
GR
GS
[0.75 0 0 0.75 0 0] CT
0.149 GC
2 setlinecap
1 LJ
0.667 LW
N
657 477.667 M
654.65 477.667 L
S
GR
GS
[0.75 0 0 0.75 0 0] CT
0.149 GC
2 setlinecap
1 LJ
0.667 LW
N
657 445 M
654.65 445 L
S
GR
GS
[0.75 0 0 0.75 0 0] CT
0.149 GC
2 setlinecap
1 LJ
0.667 LW
N
657 412.333 M
654.65 412.333 L
S
GR
GS
[0.75 0 0 0.75 0 0] CT
0.149 GC
2 setlinecap
1 LJ
0.667 LW
N
657 379.667 M
654.65 379.667 L
S
GR
GS
[0.75 0 0 0.75 0 0] CT
0.149 GC
2 setlinecap
1 LJ
0.667 LW
N
657 347 M
654.65 347 L
S
GR
GS
[0.75 0 0 0.75 312.49999 407.25] CT
0.149 GC
/Helvetica 13.333 F
GS
[1 0 0 1 0 0] CT
-8 5.5 moveto 
1 -1 scale
(0) t 
GR
GR
GS
[0.75 0 0 0.75 312.49999 382.75001] CT
0.149 GC
/Helvetica 13.333 F
GS
[1 0 0 1 0 0] CT
-19 5.5 moveto 
1 -1 scale
(0.2) t 
GR
GR
GS
[0.75 0 0 0.75 312.49999 358.24999] CT
0.149 GC
/Helvetica 13.333 F
GS
[1 0 0 1 0 0] CT
-19 5.5 moveto 
1 -1 scale
(0.4) t 
GR
GR
GS
[0.75 0 0 0.75 312.49999 333.75] CT
0.149 GC
/Helvetica 13.333 F
GS
[1 0 0 1 0 0] CT
-19 5.5 moveto 
1 -1 scale
(0.6) t 
GR
GR
GS
[0.75 0 0 0.75 312.49999 309.25001] CT
0.149 GC
/Helvetica 13.333 F
GS
[1 0 0 1 0 0] CT
-19 5.5 moveto 
1 -1 scale
(0.8) t 
GR
GR
GS
[0.75 0 0 0.75 312.49999 284.74999] CT
0.149 GC
/Helvetica 13.333 F
GS
[1 0 0 1 0 0] CT
-8 5.5 moveto 
1 -1 scale
(1) t 
GR
GR
GS
[0.75 0 0 0.75 312.49999 260.25] CT
0.149 GC
/Helvetica 13.333 F
GS
[1 0 0 1 0 0] CT
-19 5.5 moveto 
1 -1 scale
(1.2) t 
GR
GR
GS
[0 -0.75 0.75 0 295.24999 333.74993] CT
0.149 GC
/Helvetica 13.333 F
GS
[1 0 0 1 0 0] CT
-79 -3 moveto 
1 -1 scale
(Kernel misses \(normalized\)) t 
GR
GR
GS
[0.75 0 0 0.75 0 0] CT
0.149 GC
1 LJ
0.667 LW
N
422 543 M
657 543 L
S
GR
GS
[0.75 0 0 0.75 0 0] CT
0.208 0.165 0.525 RC
N
428.714 543 M
435.034 543 L
435.034 379.667 L
428.714 379.667 L
cp
f
GR
GS
[0.75 0 0 0.75 0 0] CT
0.208 0.165 0.525 RC
N
456.361 543 M
462.681 543 L
462.681 379.667 L
456.361 379.667 L
cp
f
GR
GS
[0.75 0 0 0.75 0 0] CT
0.208 0.165 0.525 RC
N
484.008 543 M
490.328 543 L
490.328 379.667 L
484.008 379.667 L
cp
f
GR
GS
[0.75 0 0 0.75 0 0] CT
0.208 0.165 0.525 RC
N
511.655 543 M
517.975 543 L
517.975 379.667 L
511.655 379.667 L
cp
f
GR
GS
[0.75 0 0 0.75 0 0] CT
0.208 0.165 0.525 RC
N
539.302 543 M
545.622 543 L
545.622 379.667 L
539.302 379.667 L
cp
f
GR
GS
[0.75 0 0 0.75 0 0] CT
0.208 0.165 0.525 RC
N
566.95 543 M
573.269 543 L
573.269 379.667 L
566.95 379.667 L
cp
f
GR
GS
[0.75 0 0 0.75 0 0] CT
0.208 0.165 0.525 RC
N
594.597 543 M
600.916 543 L
600.916 379.667 L
594.597 379.667 L
cp
f
GR
GS
[0.75 0 0 0.75 0 0] CT
0.208 0.165 0.525 RC
N
622.244 543 M
628.563 543 L
628.563 379.667 L
622.244 379.667 L
cp
f
GR
GS
[0.75 0 0 0.75 0 0] CT
10.0 ML
0.667 LW
N
428.714 543 M
428.714 379.667 L
435.034 379.667 L
435.034 543 L
cp
S
GR
GS
[0.75 0 0 0.75 0 0] CT
10.0 ML
0.667 LW
N
456.361 543 M
456.361 379.667 L
462.681 379.667 L
462.681 543 L
cp
S
GR
GS
[0.75 0 0 0.75 0 0] CT
10.0 ML
0.667 LW
N
484.008 543 M
484.008 379.667 L
490.328 379.667 L
490.328 543 L
cp
S
GR
GS
[0.75 0 0 0.75 0 0] CT
10.0 ML
0.667 LW
N
511.655 543 M
511.655 379.667 L
517.975 379.667 L
517.975 543 L
cp
S
GR
GS
[0.75 0 0 0.75 0 0] CT
10.0 ML
0.667 LW
N
539.302 543 M
539.302 379.667 L
545.622 379.667 L
545.622 543 L
cp
S
GR
GS
[0.75 0 0 0.75 0 0] CT
10.0 ML
0.667 LW
N
566.95 543 M
566.95 379.667 L
573.269 379.667 L
573.269 543 L
cp
S
GR
GS
[0.75 0 0 0.75 0 0] CT
10.0 ML
0.667 LW
N
594.597 543 M
594.597 379.667 L
600.916 379.667 L
600.916 543 L
cp
S
GR
GS
[0.75 0 0 0.75 0 0] CT
10.0 ML
0.667 LW
N
622.244 543 M
622.244 379.667 L
628.563 379.667 L
628.563 543 L
cp
S
GR
GS
[0.75 0 0 0.75 0 0] CT
0.973 0.98 0.051 RC
N
436.613 543 M
442.933 543 L
442.933 385.5 L
436.613 385.5 L
cp
f
GR
GS
[0.75 0 0 0.75 0 0] CT
0.973 0.98 0.051 RC
N
464.26 543 M
470.58 543 L
470.58 512.242 L
464.26 512.242 L
cp
f
GR
GS
[0.75 0 0 0.75 0 0] CT
0.973 0.98 0.051 RC
N
491.908 543 M
498.227 543 L
498.227 498.455 L
491.908 498.455 L
cp
f
GR
GS
[0.75 0 0 0.75 0 0] CT
0.973 0.98 0.051 RC
N
519.555 543 M
525.874 543 L
525.874 436.586 L
519.555 436.586 L
cp
f
GR
GS
[0.75 0 0 0.75 0 0] CT
0.973 0.98 0.051 RC
N
547.202 543 M
553.521 543 L
553.521 387.091 L
547.202 387.091 L
cp
f
GR
GS
[0.75 0 0 0.75 0 0] CT
0.973 0.98 0.051 RC
N
574.849 543 M
581.168 543 L
581.168 486.628 L
574.849 486.628 L
cp
f
GR
GS
[0.75 0 0 0.75 0 0] CT
0.973 0.98 0.051 RC
N
602.496 543 M
608.815 543 L
608.815 383.556 L
602.496 383.556 L
cp
f
GR
GS
[0.75 0 0 0.75 0 0] CT
0.973 0.98 0.051 RC
N
630.143 543 M
636.462 543 L
636.462 524.667 L
630.143 524.667 L
cp
f
GR
GS
[0.75 0 0 0.75 0 0] CT
10.0 ML
0.667 LW
N
436.613 543 M
436.613 385.5 L
442.933 385.5 L
442.933 543 L
cp
S
GR
GS
[0.75 0 0 0.75 0 0] CT
10.0 ML
0.667 LW
N
464.26 543 M
464.26 512.242 L
470.58 512.242 L
470.58 543 L
cp
S
GR
GS
[0.75 0 0 0.75 0 0] CT
10.0 ML
0.667 LW
N
491.908 543 M
491.908 498.455 L
498.227 498.455 L
498.227 543 L
cp
S
GR
GS
[0.75 0 0 0.75 0 0] CT
10.0 ML
0.667 LW
N
519.555 543 M
519.555 436.586 L
525.874 436.586 L
525.874 543 L
cp
S
GR
GS
[0.75 0 0 0.75 0 0] CT
10.0 ML
0.667 LW
N
547.202 543 M
547.202 387.091 L
553.521 387.091 L
553.521 543 L
cp
S
GR
GS
[0.75 0 0 0.75 0 0] CT
10.0 ML
0.667 LW
N
574.849 543 M
574.849 486.628 L
581.168 486.628 L
581.168 543 L
cp
S
GR
GS
[0.75 0 0 0.75 0 0] CT
10.0 ML
0.667 LW
N
602.496 543 M
602.496 383.556 L
608.815 383.556 L
608.815 543 L
cp
S
GR
GS
[0.75 0 0 0.75 0 0] CT
10.0 ML
0.667 LW
N
630.143 543 M
630.143 524.667 L
636.462 524.667 L
636.462 543 L
cp
S
GR
GS
[0.75 0 0 0.75 0 0] CT
1 GC
N
535 371 M
535 335 L
651 335 L
651 371 L
cp
f
GR
GS
[0.75 0 0 0.75 428.76283 258.64725] CT
/Helvetica 12 F
GS
[1 0 0 1 0 0] CT
0 5 moveto 
1 -1 scale
(Coherent) t 
GR
GR
GS
[0.75 0 0 0.75 0 0] CT
0.208 0.165 0.525 RC
N
538.966 350.929 M
538.966 338.797 L
568.709 338.797 L
568.709 350.929 L
cp
f
GR
GS
[0.75 0 0 0.75 0 0] CT
10.0 ML
0.667 LW
N
538.966 350.929 M
538.966 338.797 L
568.709 338.797 L
568.709 350.929 L
cp
S
GR
GS
[0.75 0 0 0.75 428.76283 270.85275] CT
/Helvetica 12 F
GS
[1 0 0 1 0 0] CT
0 5 moveto 
1 -1 scale
(Non-Coherent) t 
GR
GR
GS
[0.75 0 0 0.75 0 0] CT
0.973 0.98 0.051 RC
N
538.966 367.203 M
538.966 355.071 L
568.709 355.071 L
568.709 367.203 L
cp
f
GR
GS
[0.75 0 0 0.75 0 0] CT
10.0 ML
0.667 LW
N
538.966 367.203 M
538.966 355.071 L
568.709 355.071 L
568.709 367.203 L
cp
S
GR
GS
[0.75 0 0 0.75 0 0] CT
0.149 GC
10.0 ML
0.667 LW
N
535 371 M
535 335 L
651 335 L
651 371 L
cp
S
GR
GS
[0.75 0 0 0.75 0 0] CT
1 GC
N
708 542 M
943 542 L
943 348 L
708 348 L
cp
f
GR
GS
[0.75 0 0 0.75 0 0] CT
0.873 GC
1 LJ
0.667 LW
N
721.824 542 M
721.824 348 L
S
GR
GS
[0.75 0 0 0.75 0 0] CT
0.873 GC
1 LJ
0.667 LW
N
749.471 542 M
749.471 348 L
S
GR
GS
[0.75 0 0 0.75 0 0] CT
0.873 GC
1 LJ
0.667 LW
N
777.118 542 M
777.118 348 L
S
GR
GS
[0.75 0 0 0.75 0 0] CT
0.873 GC
1 LJ
0.667 LW
N
804.765 542 M
804.765 348 L
S
GR
GS
[0.75 0 0 0.75 0 0] CT
0.873 GC
1 LJ
0.667 LW
N
832.412 542 M
832.412 348 L
S
GR
GS
[0.75 0 0 0.75 0 0] CT
0.873 GC
1 LJ
0.667 LW
N
860.059 542 M
860.059 348 L
S
GR
GS
[0.75 0 0 0.75 0 0] CT
0.873 GC
1 LJ
0.667 LW
N
887.706 542 M
887.706 348 L
S
GR
GS
[0.75 0 0 0.75 0 0] CT
0.873 GC
1 LJ
0.667 LW
N
915.353 542 M
915.353 348 L
S
GR
GS
[0.75 0 0 0.75 0 0] CT
0.873 GC
1 LJ
0.667 LW
N
943 542 M
708 542 L
S
GR
GS
[0.75 0 0 0.75 0 0] CT
0.873 GC
1 LJ
0.667 LW
N
943 509.667 M
708 509.667 L
S
GR
GS
[0.75 0 0 0.75 0 0] CT
0.873 GC
1 LJ
0.667 LW
N
943 477.333 M
708 477.333 L
S
GR
GS
[0.75 0 0 0.75 0 0] CT
0.873 GC
1 LJ
0.667 LW
N
943 445 M
708 445 L
S
GR
GS
[0.75 0 0 0.75 0 0] CT
0.873 GC
1 LJ
0.667 LW
N
943 412.667 M
708 412.667 L
S
GR
GS
[0.75 0 0 0.75 0 0] CT
0.873 GC
1 LJ
0.667 LW
N
943 380.333 M
708 380.333 L
S
GR
GS
[0.75 0 0 0.75 0 0] CT
0.873 GC
1 LJ
0.667 LW
N
943 348 M
708 348 L
S
GR
GS
[0.75 0 0 0.75 0 0] CT
0.149 GC
2 setlinecap
1 LJ
0.667 LW
N
708 542 M
943 542 L
S
GR
GS
[0.75 0 0 0.75 0 0] CT
0.149 GC
2 setlinecap
1 LJ
0.667 LW
N
708 348 M
943 348 L
S
GR
GS
[0.75 0 0 0.75 0 0] CT
0.149 GC
2 setlinecap
1 LJ
0.667 LW
N
721.824 542 M
721.824 539.65 L
S
GR
GS
[0.75 0 0 0.75 0 0] CT
0.149 GC
2 setlinecap
1 LJ
0.667 LW
N
749.471 542 M
749.471 539.65 L
S
GR
GS
[0.75 0 0 0.75 0 0] CT
0.149 GC
2 setlinecap
1 LJ
0.667 LW
N
777.118 542 M
777.118 539.65 L
S
GR
GS
[0.75 0 0 0.75 0 0] CT
0.149 GC
2 setlinecap
1 LJ
0.667 LW
N
804.765 542 M
804.765 539.65 L
S
GR
GS
[0.75 0 0 0.75 0 0] CT
0.149 GC
2 setlinecap
1 LJ
0.667 LW
N
832.412 542 M
832.412 539.65 L
S
GR
GS
[0.75 0 0 0.75 0 0] CT
0.149 GC
2 setlinecap
1 LJ
0.667 LW
N
860.059 542 M
860.059 539.65 L
S
GR
GS
[0.75 0 0 0.75 0 0] CT
0.149 GC
2 setlinecap
1 LJ
0.667 LW
N
887.706 542 M
887.706 539.65 L
S
GR
GS
[0.75 0 0 0.75 0 0] CT
0.149 GC
2 setlinecap
1 LJ
0.667 LW
N
915.353 542 M
915.353 539.65 L
S
GR
GS
[0.75 0 0 0.75 0 0] CT
0.149 GC
2 setlinecap
1 LJ
0.667 LW
N
721.824 348 M
721.824 350.35 L
S
GR
GS
[0.75 0 0 0.75 0 0] CT
0.149 GC
2 setlinecap
1 LJ
0.667 LW
N
749.471 348 M
749.471 350.35 L
S
GR
GS
[0.75 0 0 0.75 0 0] CT
0.149 GC
2 setlinecap
1 LJ
0.667 LW
N
777.118 348 M
777.118 350.35 L
S
GR
GS
[0.75 0 0 0.75 0 0] CT
0.149 GC
2 setlinecap
1 LJ
0.667 LW
N
804.765 348 M
804.765 350.35 L
S
GR
GS
[0.75 0 0 0.75 0 0] CT
0.149 GC
2 setlinecap
1 LJ
0.667 LW
N
832.412 348 M
832.412 350.35 L
S
GR
GS
[0.75 0 0 0.75 0 0] CT
0.149 GC
2 setlinecap
1 LJ
0.667 LW
N
860.059 348 M
860.059 350.35 L
S
GR
GS
[0.75 0 0 0.75 0 0] CT
0.149 GC
2 setlinecap
1 LJ
0.667 LW
N
887.706 348 M
887.706 350.35 L
S
GR
GS
[0.75 0 0 0.75 0 0] CT
0.149 GC
2 setlinecap
1 LJ
0.667 LW
N
915.353 348 M
915.353 350.35 L
S
GR
GS
[0.53033 -0.53033 0.53033 0.53033 541.36766 410.49998] CT
0.149 GC
/Helvetica 13.333 F
GS
[1 0 0 1 0 0] CT
-28 14 moveto 
1 -1 scale
(conv) t 
GR
GR
GS
[0.53033 -0.53033 0.53033 0.53033 562.10294 410.49998] CT
0.149 GC
/Helvetica 13.333 F
GS
[1 0 0 1 0 0] CT
-18 14 moveto 
1 -1 scale
(dct) t 
GR
GR
GS
[0.53033 -0.53033 0.53033 0.53033 582.83826 410.49998] CT
0.149 GC
/Helvetica 13.333 F
GS
[1 0 0 1 0 0] CT
-11 14 moveto 
1 -1 scale
(fft) t 
GR
GR
GS
[0.53033 -0.53033 0.53033 0.53033 603.57353 410.49998] CT
0.149 GC
/Helvetica 13.333 F
GS
[1 0 0 1 0 0] CT
-18 14 moveto 
1 -1 scale
(lud) t 
GR
GR
GS
[0.53033 -0.53033 0.53033 0.53033 624.30881 410.49998] CT
0.149 GC
/Helvetica 13.333 F
GS
[1 0 0 1 0 0] CT
-18 14 moveto 
1 -1 scale
(ms) t 
GR
GR
GS
[0.53033 -0.53033 0.53033 0.53033 645.04413 410.49998] CT
0.149 GC
/Helvetica 13.333 F
GS
[1 0 0 1 0 0] CT
-15 14 moveto 
1 -1 scale
(mt) t 
GR
GR
GS
[0.53033 -0.53033 0.53033 0.53033 665.7794 410.49998] CT
0.149 GC
/Helvetica 13.333 F
GS
[1 0 0 1 0 0] CT
-22 14 moveto 
1 -1 scale
(mm) t 
GR
GR
GS
[0.53033 -0.53033 0.53033 0.53033 686.51472 410.49998] CT
0.149 GC
/Helvetica 13.333 F
GS
[1 0 0 1 0 0] CT
-46 14 moveto 
1 -1 scale
(kmeans) t 
GR
GR
GS
[0.75 0 0 0.75 0 0] CT
0.149 GC
2 setlinecap
1 LJ
0.667 LW
N
708 542 M
708 348 L
S
GR
GS
[0.75 0 0 0.75 0 0] CT
0.149 GC
2 setlinecap
1 LJ
0.667 LW
N
943 542 M
943 348 L
S
GR
GS
[0.75 0 0 0.75 0 0] CT
0.149 GC
2 setlinecap
1 LJ
0.667 LW
N
708 542 M
710.35 542 L
S
GR
GS
[0.75 0 0 0.75 0 0] CT
0.149 GC
2 setlinecap
1 LJ
0.667 LW
N
708 509.667 M
710.35 509.667 L
S
GR
GS
[0.75 0 0 0.75 0 0] CT
0.149 GC
2 setlinecap
1 LJ
0.667 LW
N
708 477.333 M
710.35 477.333 L
S
GR
GS
[0.75 0 0 0.75 0 0] CT
0.149 GC
2 setlinecap
1 LJ
0.667 LW
N
708 445 M
710.35 445 L
S
GR
GS
[0.75 0 0 0.75 0 0] CT
0.149 GC
2 setlinecap
1 LJ
0.667 LW
N
708 412.667 M
710.35 412.667 L
S
GR
GS
[0.75 0 0 0.75 0 0] CT
0.149 GC
2 setlinecap
1 LJ
0.667 LW
N
708 380.333 M
710.35 380.333 L
S
GR
GS
[0.75 0 0 0.75 0 0] CT
0.149 GC
2 setlinecap
1 LJ
0.667 LW
N
708 348 M
710.35 348 L
S
GR
GS
[0.75 0 0 0.75 0 0] CT
0.149 GC
2 setlinecap
1 LJ
0.667 LW
N
943 542 M
940.65 542 L
S
GR
GS
[0.75 0 0 0.75 0 0] CT
0.149 GC
2 setlinecap
1 LJ
0.667 LW
N
943 509.667 M
940.65 509.667 L
S
GR
GS
[0.75 0 0 0.75 0 0] CT
0.149 GC
2 setlinecap
1 LJ
0.667 LW
N
943 477.333 M
940.65 477.333 L
S
GR
GS
[0.75 0 0 0.75 0 0] CT
0.149 GC
2 setlinecap
1 LJ
0.667 LW
N
943 445 M
940.65 445 L
S
GR
GS
[0.75 0 0 0.75 0 0] CT
0.149 GC
2 setlinecap
1 LJ
0.667 LW
N
943 412.667 M
940.65 412.667 L
S
GR
GS
[0.75 0 0 0.75 0 0] CT
0.149 GC
2 setlinecap
1 LJ
0.667 LW
N
943 380.333 M
940.65 380.333 L
S
GR
GS
[0.75 0 0 0.75 0 0] CT
0.149 GC
2 setlinecap
1 LJ
0.667 LW
N
943 348 M
940.65 348 L
S
GR
GS
[0.75 0 0 0.75 527.00002 406.5] CT
0.149 GC
/Helvetica 13.333 F
GS
[1 0 0 1 0 0] CT
-8 5.5 moveto 
1 -1 scale
(0) t 
GR
GR
GS
[0.75 0 0 0.75 527.00002 382.24999] CT
0.149 GC
/Helvetica 13.333 F
GS
[1 0 0 1 0 0] CT
-19 5.5 moveto 
1 -1 scale
(0.2) t 
GR
GR
GS
[0.75 0 0 0.75 527.00002 358.00001] CT
0.149 GC
/Helvetica 13.333 F
GS
[1 0 0 1 0 0] CT
-19 5.5 moveto 
1 -1 scale
(0.4) t 
GR
GR
GS
[0.75 0 0 0.75 527.00002 333.75] CT
0.149 GC
/Helvetica 13.333 F
GS
[1 0 0 1 0 0] CT
-19 5.5 moveto 
1 -1 scale
(0.6) t 
GR
GR
GS
[0.75 0 0 0.75 527.00002 309.49999] CT
0.149 GC
/Helvetica 13.333 F
GS
[1 0 0 1 0 0] CT
-19 5.5 moveto 
1 -1 scale
(0.8) t 
GR
GR
GS
[0.75 0 0 0.75 527.00002 285.25001] CT
0.149 GC
/Helvetica 13.333 F
GS
[1 0 0 1 0 0] CT
-8 5.5 moveto 
1 -1 scale
(1) t 
GR
GR
GS
[0.75 0 0 0.75 527.00002 261] CT
0.149 GC
/Helvetica 13.333 F
GS
[1 0 0 1 0 0] CT
-19 5.5 moveto 
1 -1 scale
(1.2) t 
GR
GR
GS
[0 -0.75 0.75 0 512.67201 333.74993] CT
0.149 GC
/Helvetica 13.333 F
GS
[1 0 0 1 0 0] CT
-78.5 -3 moveto 
1 -1 scale
(FLITs number \(normalized\)) t 
GR
GR
GS
[0.75 0 0 0.75 0 0] CT
0.149 GC
1 LJ
0.667 LW
N
708 542 M
943 542 L
S
GR
GS
[0.75 0 0 0.75 0 0] CT
0.208 0.165 0.525 RC
N
714.714 542 M
721.034 542 L
721.034 380.333 L
714.714 380.333 L
cp
f
GR
GS
[0.75 0 0 0.75 0 0] CT
0.208 0.165 0.525 RC
N
742.361 542 M
748.681 542 L
748.681 380.333 L
742.361 380.333 L
cp
f
GR
GS
[0.75 0 0 0.75 0 0] CT
0.208 0.165 0.525 RC
N
770.008 542 M
776.328 542 L
776.328 380.333 L
770.008 380.333 L
cp
f
GR
GS
[0.75 0 0 0.75 0 0] CT
0.208 0.165 0.525 RC
N
797.655 542 M
803.975 542 L
803.975 380.333 L
797.655 380.333 L
cp
f
GR
GS
[0.75 0 0 0.75 0 0] CT
0.208 0.165 0.525 RC
N
825.302 542 M
831.622 542 L
831.622 380.333 L
825.302 380.333 L
cp
f
GR
GS
[0.75 0 0 0.75 0 0] CT
0.208 0.165 0.525 RC
N
852.95 542 M
859.269 542 L
859.269 380.333 L
852.95 380.333 L
cp
f
GR
GS
[0.75 0 0 0.75 0 0] CT
0.208 0.165 0.525 RC
N
880.597 542 M
886.916 542 L
886.916 380.333 L
880.597 380.333 L
cp
f
GR
GS
[0.75 0 0 0.75 0 0] CT
0.208 0.165 0.525 RC
N
908.244 542 M
914.563 542 L
914.563 380.333 L
908.244 380.333 L
cp
f
GR
GS
[0.75 0 0 0.75 0 0] CT
10.0 ML
0.667 LW
N
714.714 542 M
714.714 380.333 L
721.034 380.333 L
721.034 542 L
cp
S
GR
GS
[0.75 0 0 0.75 0 0] CT
10.0 ML
0.667 LW
N
742.361 542 M
742.361 380.333 L
748.681 380.333 L
748.681 542 L
cp
S
GR
GS
[0.75 0 0 0.75 0 0] CT
10.0 ML
0.667 LW
N
770.008 542 M
770.008 380.333 L
776.328 380.333 L
776.328 542 L
cp
S
GR
GS
[0.75 0 0 0.75 0 0] CT
10.0 ML
0.667 LW
N
797.655 542 M
797.655 380.333 L
803.975 380.333 L
803.975 542 L
cp
S
GR
GS
[0.75 0 0 0.75 0 0] CT
10.0 ML
0.667 LW
N
825.302 542 M
825.302 380.333 L
831.622 380.333 L
831.622 542 L
cp
S
GR
GS
[0.75 0 0 0.75 0 0] CT
10.0 ML
0.667 LW
N
852.95 542 M
852.95 380.333 L
859.269 380.333 L
859.269 542 L
cp
S
GR
GS
[0.75 0 0 0.75 0 0] CT
10.0 ML
0.667 LW
N
880.597 542 M
880.597 380.333 L
886.916 380.333 L
886.916 542 L
cp
S
GR
GS
[0.75 0 0 0.75 0 0] CT
10.0 ML
0.667 LW
N
908.244 542 M
908.244 380.333 L
914.563 380.333 L
914.563 542 L
cp
S
GR
GS
[0.75 0 0 0.75 0 0] CT
0.973 0.98 0.051 RC
N
722.613 542 M
728.933 542 L
728.933 497.891 L
722.613 497.891 L
cp
f
GR
GS
[0.75 0 0 0.75 0 0] CT
0.973 0.98 0.051 RC
N
750.26 542 M
756.58 542 L
756.58 444.757 L
750.26 444.757 L
cp
f
GR
GS
[0.75 0 0 0.75 0 0] CT
0.973 0.98 0.051 RC
N
777.908 542 M
784.227 542 L
784.227 443.3 L
777.908 443.3 L
cp
f
GR
GS
[0.75 0 0 0.75 0 0] CT
0.973 0.98 0.051 RC
N
805.555 542 M
811.874 542 L
811.874 450.953 L
805.555 450.953 L
cp
f
GR
GS
[0.75 0 0 0.75 0 0] CT
0.973 0.98 0.051 RC
N
833.202 542 M
839.521 542 L
839.521 496.24 L
833.202 496.24 L
cp
f
GR
GS
[0.75 0 0 0.75 0 0] CT
0.973 0.98 0.051 RC
N
860.849 542 M
867.168 542 L
867.168 472.566 L
860.849 472.566 L
cp
f
GR
GS
[0.75 0 0 0.75 0 0] CT
0.973 0.98 0.051 RC
N
888.496 542 M
894.815 542 L
894.815 406.279 L
888.496 406.279 L
cp
f
GR
GS
[0.75 0 0 0.75 0 0] CT
0.973 0.98 0.051 RC
N
916.143 542 M
922.462 542 L
922.462 490.709 L
916.143 490.709 L
cp
f
GR
GS
[0.75 0 0 0.75 0 0] CT
10.0 ML
0.667 LW
N
722.613 542 M
722.613 497.891 L
728.933 497.891 L
728.933 542 L
cp
S
GR
GS
[0.75 0 0 0.75 0 0] CT
10.0 ML
0.667 LW
N
750.26 542 M
750.26 444.757 L
756.58 444.757 L
756.58 542 L
cp
S
GR
GS
[0.75 0 0 0.75 0 0] CT
10.0 ML
0.667 LW
N
777.908 542 M
777.908 443.3 L
784.227 443.3 L
784.227 542 L
cp
S
GR
GS
[0.75 0 0 0.75 0 0] CT
10.0 ML
0.667 LW
N
805.555 542 M
805.555 450.953 L
811.874 450.953 L
811.874 542 L
cp
S
GR
GS
[0.75 0 0 0.75 0 0] CT
10.0 ML
0.667 LW
N
833.202 542 M
833.202 496.24 L
839.521 496.24 L
839.521 542 L
cp
S
GR
GS
[0.75 0 0 0.75 0 0] CT
10.0 ML
0.667 LW
N
860.849 542 M
860.849 472.566 L
867.168 472.566 L
867.168 542 L
cp
S
GR
GS
[0.75 0 0 0.75 0 0] CT
10.0 ML
0.667 LW
N
888.496 542 M
888.496 406.279 L
894.815 406.279 L
894.815 542 L
cp
S
GR
GS
[0.75 0 0 0.75 0 0] CT
10.0 ML
0.667 LW
N
916.143 542 M
916.143 490.709 L
922.462 490.709 L
922.462 542 L
cp
S
GR
GS
[0.75 0 0 0.75 0 0] CT
1 GC
N
820 370 M
820 334 L
936 334 L
936 370 L
cp
f
GR
GS
[0.75 0 0 0.75 642.51283 257.89725] CT
/Helvetica 12 F
GS
[1 0 0 1 0 0] CT
0 5 moveto 
1 -1 scale
(Coherent) t 
GR
GR
GS
[0.75 0 0 0.75 0 0] CT
0.208 0.165 0.525 RC
N
823.966 349.929 M
823.966 337.797 L
853.709 337.797 L
853.709 349.929 L
cp
f
GR
GS
[0.75 0 0 0.75 0 0] CT
10.0 ML
0.667 LW
N
823.966 349.929 M
823.966 337.797 L
853.709 337.797 L
853.709 349.929 L
cp
S
GR
GS
[0.75 0 0 0.75 642.51283 270.10275] CT
/Helvetica 12 F
GS
[1 0 0 1 0 0] CT
0 5 moveto 
1 -1 scale
(Non-Coherent) t 
GR
GR
GS
[0.75 0 0 0.75 0 0] CT
0.973 0.98 0.051 RC
N
823.966 366.203 M
823.966 354.071 L
853.709 354.071 L
853.709 366.203 L
cp
f
GR
GS
[0.75 0 0 0.75 0 0] CT
10.0 ML
0.667 LW
N
823.966 366.203 M
823.966 354.071 L
853.709 354.071 L
853.709 366.203 L
cp
S
GR
GS
[0.75 0 0 0.75 0 0] CT
0.149 GC
10.0 ML
0.667 LW
N
820 370 M
820 334 L
936 334 L
936 370 L
cp
S
GR
GS
[0.75 0 0 0.75 0 0] CT
1 GC
N
1005 542 M
1240 542 L
1240 348 L
1005 348 L
cp
f
GR
GS
[0.75 0 0 0.75 0 0] CT
0.873 GC
1 LJ
0.667 LW
N
1018.824 542 M
1018.824 348 L
S
GR
GS
[0.75 0 0 0.75 0 0] CT
0.873 GC
1 LJ
0.667 LW
N
1046.471 542 M
1046.471 348 L
S
GR
GS
[0.75 0 0 0.75 0 0] CT
0.873 GC
1 LJ
0.667 LW
N
1074.118 542 M
1074.118 348 L
S
GR
GS
[0.75 0 0 0.75 0 0] CT
0.873 GC
1 LJ
0.667 LW
N
1101.765 542 M
1101.765 348 L
S
GR
GS
[0.75 0 0 0.75 0 0] CT
0.873 GC
1 LJ
0.667 LW
N
1129.412 542 M
1129.412 348 L
S
GR
GS
[0.75 0 0 0.75 0 0] CT
0.873 GC
1 LJ
0.667 LW
N
1157.059 542 M
1157.059 348 L
S
GR
GS
[0.75 0 0 0.75 0 0] CT
0.873 GC
1 LJ
0.667 LW
N
1184.706 542 M
1184.706 348 L
S
GR
GS
[0.75 0 0 0.75 0 0] CT
0.873 GC
1 LJ
0.667 LW
N
1212.353 542 M
1212.353 348 L
S
GR
GS
[0.75 0 0 0.75 0 0] CT
0.873 GC
1 LJ
0.667 LW
N
1240 542 M
1005 542 L
S
GR
GS
[0.75 0 0 0.75 0 0] CT
0.873 GC
1 LJ
0.667 LW
N
1240 503.2 M
1005 503.2 L
S
GR
GS
[0.75 0 0 0.75 0 0] CT
0.873 GC
1 LJ
0.667 LW
N
1240 464.4 M
1005 464.4 L
S
GR
GS
[0.75 0 0 0.75 0 0] CT
0.873 GC
1 LJ
0.667 LW
N
1240 425.6 M
1005 425.6 L
S
GR
GS
[0.75 0 0 0.75 0 0] CT
0.873 GC
1 LJ
0.667 LW
N
1240 386.8 M
1005 386.8 L
S
GR
GS
[0.75 0 0 0.75 0 0] CT
0.873 GC
1 LJ
0.667 LW
N
1240 348 M
1005 348 L
S
GR
GS
[0.75 0 0 0.75 0 0] CT
0.149 GC
2 setlinecap
1 LJ
0.667 LW
N
1005 542 M
1240 542 L
S
GR
GS
[0.75 0 0 0.75 0 0] CT
0.149 GC
2 setlinecap
1 LJ
0.667 LW
N
1005 348 M
1240 348 L
S
GR
GS
[0.75 0 0 0.75 0 0] CT
0.149 GC
2 setlinecap
1 LJ
0.667 LW
N
1018.824 542 M
1018.824 539.65 L
S
GR
GS
[0.75 0 0 0.75 0 0] CT
0.149 GC
2 setlinecap
1 LJ
0.667 LW
N
1046.471 542 M
1046.471 539.65 L
S
GR
GS
[0.75 0 0 0.75 0 0] CT
0.149 GC
2 setlinecap
1 LJ
0.667 LW
N
1074.118 542 M
1074.118 539.65 L
S
GR
GS
[0.75 0 0 0.75 0 0] CT
0.149 GC
2 setlinecap
1 LJ
0.667 LW
N
1101.765 542 M
1101.765 539.65 L
S
GR
GS
[0.75 0 0 0.75 0 0] CT
0.149 GC
2 setlinecap
1 LJ
0.667 LW
N
1129.412 542 M
1129.412 539.65 L
S
GR
GS
[0.75 0 0 0.75 0 0] CT
0.149 GC
2 setlinecap
1 LJ
0.667 LW
N
1157.059 542 M
1157.059 539.65 L
S
GR
GS
[0.75 0 0 0.75 0 0] CT
0.149 GC
2 setlinecap
1 LJ
0.667 LW
N
1184.706 542 M
1184.706 539.65 L
S
GR
GS
[0.75 0 0 0.75 0 0] CT
0.149 GC
2 setlinecap
1 LJ
0.667 LW
N
1212.353 542 M
1212.353 539.65 L
S
GR
GS
[0.75 0 0 0.75 0 0] CT
0.149 GC
2 setlinecap
1 LJ
0.667 LW
N
1018.824 348 M
1018.824 350.35 L
S
GR
GS
[0.75 0 0 0.75 0 0] CT
0.149 GC
2 setlinecap
1 LJ
0.667 LW
N
1046.471 348 M
1046.471 350.35 L
S
GR
GS
[0.75 0 0 0.75 0 0] CT
0.149 GC
2 setlinecap
1 LJ
0.667 LW
N
1074.118 348 M
1074.118 350.35 L
S
GR
GS
[0.75 0 0 0.75 0 0] CT
0.149 GC
2 setlinecap
1 LJ
0.667 LW
N
1101.765 348 M
1101.765 350.35 L
S
GR
GS
[0.75 0 0 0.75 0 0] CT
0.149 GC
2 setlinecap
1 LJ
0.667 LW
N
1129.412 348 M
1129.412 350.35 L
S
GR
GS
[0.75 0 0 0.75 0 0] CT
0.149 GC
2 setlinecap
1 LJ
0.667 LW
N
1157.059 348 M
1157.059 350.35 L
S
GR
GS
[0.75 0 0 0.75 0 0] CT
0.149 GC
2 setlinecap
1 LJ
0.667 LW
N
1184.706 348 M
1184.706 350.35 L
S
GR
GS
[0.75 0 0 0.75 0 0] CT
0.149 GC
2 setlinecap
1 LJ
0.667 LW
N
1212.353 348 M
1212.353 350.35 L
S
GR
GS
[0.53033 -0.53033 0.53033 0.53033 764.11766 410.49998] CT
0.149 GC
/Helvetica 13.333 F
GS
[1 0 0 1 0 0] CT
-28 14 moveto 
1 -1 scale
(conv) t 
GR
GR
GS
[0.53033 -0.53033 0.53033 0.53033 784.85294 410.49998] CT
0.149 GC
/Helvetica 13.333 F
GS
[1 0 0 1 0 0] CT
-18 14 moveto 
1 -1 scale
(dct) t 
GR
GR
GS
[0.53033 -0.53033 0.53033 0.53033 805.58826 410.49998] CT
0.149 GC
/Helvetica 13.333 F
GS
[1 0 0 1 0 0] CT
-11 14 moveto 
1 -1 scale
(fft) t 
GR
GR
GS
[0.53033 -0.53033 0.53033 0.53033 826.32349 410.49998] CT
0.149 GC
/Helvetica 13.333 F
GS
[1 0 0 1 0 0] CT
-18 14 moveto 
1 -1 scale
(lud) t 
GR
GR
GS
[0.53033 -0.53033 0.53033 0.53033 847.05881 410.49998] CT
0.149 GC
/Helvetica 13.333 F
GS
[1 0 0 1 0 0] CT
-18 14 moveto 
1 -1 scale
(ms) t 
GR
GR
GS
[0.53033 -0.53033 0.53033 0.53033 867.79413 410.49998] CT
0.149 GC
/Helvetica 13.333 F
GS
[1 0 0 1 0 0] CT
-15 14 moveto 
1 -1 scale
(mt) t 
GR
GR
GS
[0.53033 -0.53033 0.53033 0.53033 888.52945 410.49998] CT
0.149 GC
/Helvetica 13.333 F
GS
[1 0 0 1 0 0] CT
-22 14 moveto 
1 -1 scale
(mm) t 
GR
GR
GS
[0.53033 -0.53033 0.53033 0.53033 909.26468 410.49998] CT
0.149 GC
/Helvetica 13.333 F
GS
[1 0 0 1 0 0] CT
-46 14 moveto 
1 -1 scale
(kmeans) t 
GR
GR
GS
[0.75 0 0 0.75 0 0] CT
0.149 GC
2 setlinecap
1 LJ
0.667 LW
N
1005 542 M
1005 348 L
S
GR
GS
[0.75 0 0 0.75 0 0] CT
0.149 GC
2 setlinecap
1 LJ
0.667 LW
N
1240 542 M
1240 348 L
S
GR
GS
[0.75 0 0 0.75 0 0] CT
0.149 GC
2 setlinecap
1 LJ
0.667 LW
N
1005 542 M
1007.35 542 L
S
GR
GS
[0.75 0 0 0.75 0 0] CT
0.149 GC
2 setlinecap
1 LJ
0.667 LW
N
1005 503.2 M
1007.35 503.2 L
S
GR
GS
[0.75 0 0 0.75 0 0] CT
0.149 GC
2 setlinecap
1 LJ
0.667 LW
N
1005 464.4 M
1007.35 464.4 L
S
GR
GS
[0.75 0 0 0.75 0 0] CT
0.149 GC
2 setlinecap
1 LJ
0.667 LW
N
1005 425.6 M
1007.35 425.6 L
S
GR
GS
[0.75 0 0 0.75 0 0] CT
0.149 GC
2 setlinecap
1 LJ
0.667 LW
N
1005 386.8 M
1007.35 386.8 L
S
GR
GS
[0.75 0 0 0.75 0 0] CT
0.149 GC
2 setlinecap
1 LJ
0.667 LW
N
1005 348 M
1007.35 348 L
S
GR
GS
[0.75 0 0 0.75 0 0] CT
0.149 GC
2 setlinecap
1 LJ
0.667 LW
N
1240 542 M
1237.65 542 L
S
GR
GS
[0.75 0 0 0.75 0 0] CT
0.149 GC
2 setlinecap
1 LJ
0.667 LW
N
1240 503.2 M
1237.65 503.2 L
S
GR
GS
[0.75 0 0 0.75 0 0] CT
0.149 GC
2 setlinecap
1 LJ
0.667 LW
N
1240 464.4 M
1237.65 464.4 L
S
GR
GS
[0.75 0 0 0.75 0 0] CT
0.149 GC
2 setlinecap
1 LJ
0.667 LW
N
1240 425.6 M
1237.65 425.6 L
S
GR
GS
[0.75 0 0 0.75 0 0] CT
0.149 GC
2 setlinecap
1 LJ
0.667 LW
N
1240 386.8 M
1237.65 386.8 L
S
GR
GS
[0.75 0 0 0.75 0 0] CT
0.149 GC
2 setlinecap
1 LJ
0.667 LW
N
1240 348 M
1237.65 348 L
S
GR
GS
[0.75 0 0 0.75 749.75002 406.5] CT
0.149 GC
/Helvetica 13.333 F
GS
[1 0 0 1 0 0] CT
-19 5.5 moveto 
1 -1 scale
(0.8) t 
GR
GR
GS
[0.75 0 0 0.75 749.75002 377.39999] CT
0.149 GC
/Helvetica 13.333 F
GS
[1 0 0 1 0 0] CT
-26 5.5 moveto 
1 -1 scale
(0.85) t 
GR
GR
GS
[0.75 0 0 0.75 749.75002 348.30002] CT
0.149 GC
/Helvetica 13.333 F
GS
[1 0 0 1 0 0] CT
-19 5.5 moveto 
1 -1 scale
(0.9) t 
GR
GR
GS
[0.75 0 0 0.75 749.75002 319.2] CT
0.149 GC
/Helvetica 13.333 F
GS
[1 0 0 1 0 0] CT
-26 5.5 moveto 
1 -1 scale
(0.95) t 
GR
GR
GS
[0.75 0 0 0.75 749.75002 290.09999] CT
0.149 GC
/Helvetica 13.333 F
GS
[1 0 0 1 0 0] CT
-8 5.5 moveto 
1 -1 scale
(1) t 
GR
GR
GS
[0.75 0 0 0.75 749.75002 261.00002] CT
0.149 GC
/Helvetica 13.333 F
GS
[1 0 0 1 0 0] CT
-26 5.5 moveto 
1 -1 scale
(1.05) t 
GR
GR
GS
[0 -0.75 0.75 0 730.31708 333.74995] CT
0.149 GC
/Helvetica 13.333 F
GS
[1 0 0 1 0 0] CT
-120 -3 moveto 
1 -1 scale
(Network power consumption \(normalized\)) t 
GR
GR
GS
[0.75 0 0 0.75 0 0] CT
0.149 GC
1 LJ
0.667 LW
N
1005 542 M
1240 542 L
S
GR
GS
[0.75 0 0 0.75 0 0] CT
0.208 0.165 0.525 RC
N
1011.714 542 M
1011.714 386.8 L
1018.034 386.8 L
1018.034 542 L
cp
f
GR
GS
[0.75 0 0 0.75 0 0] CT
0.208 0.165 0.525 RC
N
1039.361 542 M
1039.361 386.8 L
1045.681 386.8 L
1045.681 542 L
cp
f
GR
GS
[0.75 0 0 0.75 0 0] CT
0.208 0.165 0.525 RC
N
1067.008 542 M
1067.008 386.8 L
1073.328 386.8 L
1073.328 542 L
cp
f
GR
GS
[0.75 0 0 0.75 0 0] CT
0.208 0.165 0.525 RC
N
1094.656 542 M
1094.656 386.8 L
1100.975 386.8 L
1100.975 542 L
cp
f
GR
GS
[0.75 0 0 0.75 0 0] CT
0.208 0.165 0.525 RC
N
1122.302 542 M
1122.302 386.8 L
1128.622 386.8 L
1128.622 542 L
cp
f
GR
GS
[0.75 0 0 0.75 0 0] CT
0.208 0.165 0.525 RC
N
1149.95 542 M
1149.95 386.8 L
1156.269 386.8 L
1156.269 542 L
cp
f
GR
GS
[0.75 0 0 0.75 0 0] CT
0.208 0.165 0.525 RC
N
1177.597 542 M
1177.597 386.8 L
1183.916 386.8 L
1183.916 542 L
cp
f
GR
GS
[0.75 0 0 0.75 0 0] CT
0.208 0.165 0.525 RC
N
1205.244 542 M
1205.244 386.8 L
1211.563 386.8 L
1211.563 542 L
cp
f
GR
GS
[0.75 0 0 0.75 0 0] CT
1 LJ
0.667 LW
N
1011.714 542 M
1011.714 386.8 L
S
GR
GS
[0.75 0 0 0.75 0 0] CT
1 setlinecap
10.0 ML
0.667 LW
N
1011.714 386.8 M
1018.034 386.8 L
S
GR
GS
[0.75 0 0 0.75 0 0] CT
1 setlinecap
10.0 ML
0.667 LW
N
1018.034 386.8 M
1018.034 542 L
S
GR
GS
[0.75 0 0 0.75 0 0] CT
10.0 ML
0.667 LW
N
1018.034 542 M
1011.714 542 L
S
GR
GS
[0.75 0 0 0.75 0 0] CT
10.0 ML
0.667 LW
N
1039.361 542 M
1039.361 386.8 L
S
GR
GS
[0.75 0 0 0.75 0 0] CT
1 setlinecap
10.0 ML
0.667 LW
N
1039.361 386.8 M
1045.681 386.8 L
S
GR
GS
[0.75 0 0 0.75 0 0] CT
1 setlinecap
10.0 ML
0.667 LW
N
1045.681 386.8 M
1045.681 542 L
S
GR
GS
[0.75 0 0 0.75 0 0] CT
10.0 ML
0.667 LW
N
1045.681 542 M
1039.361 542 L
S
GR
GS
[0.75 0 0 0.75 0 0] CT
10.0 ML
0.667 LW
N
1067.008 542 M
1067.008 386.8 L
S
GR
GS
[0.75 0 0 0.75 0 0] CT
1 setlinecap
10.0 ML
0.667 LW
N
1067.008 386.8 M
1073.328 386.8 L
S
GR
GS
[0.75 0 0 0.75 0 0] CT
1 setlinecap
10.0 ML
0.667 LW
N
1073.328 386.8 M
1073.328 542 L
S
GR
GS
[0.75 0 0 0.75 0 0] CT
10.0 ML
0.667 LW
N
1073.328 542 M
1067.008 542 L
S
GR
GS
[0.75 0 0 0.75 0 0] CT
10.0 ML
0.667 LW
N
1094.656 542 M
1094.656 386.8 L
S
GR
GS
[0.75 0 0 0.75 0 0] CT
1 setlinecap
10.0 ML
0.667 LW
N
1094.656 386.8 M
1100.975 386.8 L
S
GR
GS
[0.75 0 0 0.75 0 0] CT
1 setlinecap
10.0 ML
0.667 LW
N
1100.975 386.8 M
1100.975 542 L
S
GR
GS
[0.75 0 0 0.75 0 0] CT
10.0 ML
0.667 LW
N
1100.975 542 M
1094.656 542 L
S
GR
GS
[0.75 0 0 0.75 0 0] CT
10.0 ML
0.667 LW
N
1122.302 542 M
1122.302 386.8 L
S
GR
GS
[0.75 0 0 0.75 0 0] CT
1 setlinecap
10.0 ML
0.667 LW
N
1122.302 386.8 M
1128.622 386.8 L
S
GR
GS
[0.75 0 0 0.75 0 0] CT
1 setlinecap
10.0 ML
0.667 LW
N
1128.622 386.8 M
1128.622 542 L
S
GR
GS
[0.75 0 0 0.75 0 0] CT
10.0 ML
0.667 LW
N
1128.622 542 M
1122.302 542 L
S
GR
GS
[0.75 0 0 0.75 0 0] CT
10.0 ML
0.667 LW
N
1149.95 542 M
1149.95 386.8 L
S
GR
GS
[0.75 0 0 0.75 0 0] CT
1 setlinecap
10.0 ML
0.667 LW
N
1149.95 386.8 M
1156.269 386.8 L
S
GR
GS
[0.75 0 0 0.75 0 0] CT
1 setlinecap
10.0 ML
0.667 LW
N
1156.269 386.8 M
1156.269 542 L
S
GR
GS
[0.75 0 0 0.75 0 0] CT
10.0 ML
0.667 LW
N
1156.269 542 M
1149.95 542 L
S
GR
GS
[0.75 0 0 0.75 0 0] CT
10.0 ML
0.667 LW
N
1177.597 542 M
1177.597 386.8 L
S
GR
GS
[0.75 0 0 0.75 0 0] CT
1 setlinecap
10.0 ML
0.667 LW
N
1177.597 386.8 M
1183.916 386.8 L
S
GR
GS
[0.75 0 0 0.75 0 0] CT
1 setlinecap
10.0 ML
0.667 LW
N
1183.916 386.8 M
1183.916 542 L
S
GR
GS
[0.75 0 0 0.75 0 0] CT
10.0 ML
0.667 LW
N
1183.916 542 M
1177.597 542 L
S
GR
GS
[0.75 0 0 0.75 0 0] CT
10.0 ML
0.667 LW
N
1205.244 542 M
1205.244 386.8 L
S
GR
GS
[0.75 0 0 0.75 0 0] CT
1 setlinecap
10.0 ML
0.667 LW
N
1205.244 386.8 M
1211.563 386.8 L
S
GR
GS
[0.75 0 0 0.75 0 0] CT
1 setlinecap
10.0 ML
0.667 LW
N
1211.563 386.8 M
1211.563 542 L
S
GR
GS
[0.75 0 0 0.75 0 0] CT
10.0 ML
0.667 LW
N
1211.563 542 M
1205.244 542 L
S
GR
GS
[0.75 0 0 0.75 0 0] CT
0.973 0.98 0.051 RC
N
1019.613 542 M
1019.613 395.714 L
1025.933 395.714 L
1025.933 542 L
cp
f
GR
GS
[0.75 0 0 0.75 0 0] CT
0.973 0.98 0.051 RC
N
1047.26 542 M
1047.26 412.905 L
1053.58 412.905 L
1053.58 542 L
cp
f
GR
GS
[0.75 0 0 0.75 0 0] CT
0.973 0.98 0.051 RC
N
1074.908 542 M
1074.908 389.403 L
1081.227 389.403 L
1081.227 542 L
cp
f
GR
GS
[0.75 0 0 0.75 0 0] CT
0.973 0.98 0.051 RC
N
1102.555 542 M
1102.555 408.102 L
1108.874 408.102 L
1108.874 542 L
cp
f
GR
GS
[0.75 0 0 0.75 0 0] CT
0.973 0.98 0.051 RC
N
1130.202 542 M
1130.202 405.077 L
1136.521 405.077 L
1136.521 542 L
cp
f
GR
GS
[0.75 0 0 0.75 0 0] CT
0.973 0.98 0.051 RC
N
1157.849 542 M
1157.849 428.193 L
1164.168 428.193 L
1164.168 542 L
cp
f
GR
GS
[0.75 0 0 0.75 0 0] CT
0.973 0.98 0.051 RC
N
1185.496 542 M
1185.496 394.354 L
1191.815 394.354 L
1191.815 542 L
cp
f
GR
GS
[0.75 0 0 0.75 0 0] CT
0.973 0.98 0.051 RC
N
1213.143 542 M
1213.143 402.163 L
1219.462 402.163 L
1219.462 542 L
cp
f
GR
GS
[0.75 0 0 0.75 0 0] CT
10.0 ML
0.667 LW
N
1019.613 542 M
1019.613 395.714 L
S
GR
GS
[0.75 0 0 0.75 0 0] CT
1 setlinecap
10.0 ML
0.667 LW
N
1019.613 395.714 M
1025.933 395.714 L
S
GR
GS
[0.75 0 0 0.75 0 0] CT
1 setlinecap
10.0 ML
0.667 LW
N
1025.933 395.714 M
1025.933 542 L
S
GR
GS
[0.75 0 0 0.75 0 0] CT
10.0 ML
0.667 LW
N
1025.933 542 M
1019.613 542 L
S
GR
GS
[0.75 0 0 0.75 0 0] CT
10.0 ML
0.667 LW
N
1047.26 542 M
1047.26 412.905 L
S
GR
GS
[0.75 0 0 0.75 0 0] CT
1 setlinecap
10.0 ML
0.667 LW
N
1047.26 412.905 M
1053.58 412.905 L
S
GR
GS
[0.75 0 0 0.75 0 0] CT
1 setlinecap
10.0 ML
0.667 LW
N
1053.58 412.905 M
1053.58 542 L
S
GR
GS
[0.75 0 0 0.75 0 0] CT
10.0 ML
0.667 LW
N
1053.58 542 M
1047.26 542 L
S
GR
GS
[0.75 0 0 0.75 0 0] CT
10.0 ML
0.667 LW
N
1074.908 542 M
1074.908 389.403 L
S
GR
GS
[0.75 0 0 0.75 0 0] CT
1 setlinecap
10.0 ML
0.667 LW
N
1074.908 389.403 M
1081.227 389.403 L
S
GR
GS
[0.75 0 0 0.75 0 0] CT
1 setlinecap
10.0 ML
0.667 LW
N
1081.227 389.403 M
1081.227 542 L
S
GR
GS
[0.75 0 0 0.75 0 0] CT
10.0 ML
0.667 LW
N
1081.227 542 M
1074.908 542 L
S
GR
GS
[0.75 0 0 0.75 0 0] CT
10.0 ML
0.667 LW
N
1102.555 542 M
1102.555 408.102 L
S
GR
GS
[0.75 0 0 0.75 0 0] CT
1 setlinecap
10.0 ML
0.667 LW
N
1102.555 408.102 M
1108.874 408.102 L
S
GR
GS
[0.75 0 0 0.75 0 0] CT
1 setlinecap
10.0 ML
0.667 LW
N
1108.874 408.102 M
1108.874 542 L
S
GR
GS
[0.75 0 0 0.75 0 0] CT
10.0 ML
0.667 LW
N
1108.874 542 M
1102.555 542 L
S
GR
GS
[0.75 0 0 0.75 0 0] CT
10.0 ML
0.667 LW
N
1130.202 542 M
1130.202 405.077 L
S
GR
GS
[0.75 0 0 0.75 0 0] CT
1 setlinecap
10.0 ML
0.667 LW
N
1130.202 405.077 M
1136.521 405.077 L
S
GR
GS
[0.75 0 0 0.75 0 0] CT
1 setlinecap
10.0 ML
0.667 LW
N
1136.521 405.077 M
1136.521 542 L
S
GR
GS
[0.75 0 0 0.75 0 0] CT
10.0 ML
0.667 LW
N
1136.521 542 M
1130.202 542 L
S
GR
GS
[0.75 0 0 0.75 0 0] CT
10.0 ML
0.667 LW
N
1157.849 542 M
1157.849 428.193 L
S
GR
GS
[0.75 0 0 0.75 0 0] CT
1 setlinecap
10.0 ML
0.667 LW
N
1157.849 428.193 M
1164.168 428.193 L
S
GR
GS
[0.75 0 0 0.75 0 0] CT
1 setlinecap
10.0 ML
0.667 LW
N
1164.168 428.193 M
1164.168 542 L
S
GR
GS
[0.75 0 0 0.75 0 0] CT
10.0 ML
0.667 LW
N
1164.168 542 M
1157.849 542 L
S
GR
GS
[0.75 0 0 0.75 0 0] CT
10.0 ML
0.667 LW
N
1185.496 542 M
1185.496 394.354 L
S
GR
GS
[0.75 0 0 0.75 0 0] CT
1 setlinecap
10.0 ML
0.667 LW
N
1185.496 394.354 M
1191.815 394.354 L
S
GR
GS
[0.75 0 0 0.75 0 0] CT
1 setlinecap
10.0 ML
0.667 LW
N
1191.815 394.354 M
1191.815 542 L
S
GR
GS
[0.75 0 0 0.75 0 0] CT
10.0 ML
0.667 LW
N
1191.815 542 M
1185.496 542 L
S
GR
GS
[0.75 0 0 0.75 0 0] CT
10.0 ML
0.667 LW
N
1213.143 542 M
1213.143 402.163 L
S
GR
GS
[0.75 0 0 0.75 0 0] CT
1 setlinecap
10.0 ML
0.667 LW
N
1213.143 402.163 M
1219.462 402.163 L
S
GR
GS
[0.75 0 0 0.75 0 0] CT
1 setlinecap
10.0 ML
0.667 LW
N
1219.462 402.163 M
1219.462 542 L
S
GR
GS
[0.75 0 0 0.75 0 0] CT
10.0 ML
0.667 LW
N
1219.462 542 M
1213.143 542 L
S
GR
GS
[0.75 0 0 0.75 0 0] CT
1 GC
N
1118 370 M
1118 334 L
1234 334 L
1234 370 L
cp
f
GR
GS
[0.75 0 0 0.75 866.01279 257.89725] CT
/Helvetica 12 F
GS
[1 0 0 1 0 0] CT
0 5 moveto 
1 -1 scale
(Coherent) t 
GR
GR
GS
[0.75 0 0 0.75 0 0] CT
0.208 0.165 0.525 RC
N
1121.966 349.929 M
1121.966 337.797 L
1151.709 337.797 L
1151.709 349.929 L
cp
f
GR
GS
[0.75 0 0 0.75 0 0] CT
10.0 ML
0.667 LW
N
1121.966 349.929 M
1121.966 337.797 L
1151.709 337.797 L
1151.709 349.929 L
cp
S
GR
GS
[0.75 0 0 0.75 866.01279 270.10275] CT
/Helvetica 12 F
GS
[1 0 0 1 0 0] CT
0 5 moveto 
1 -1 scale
(Non-Coherent) t 
GR
GR
GS
[0.75 0 0 0.75 0 0] CT
0.973 0.98 0.051 RC
N
1121.966 366.203 M
1121.966 354.071 L
1151.709 354.071 L
1151.709 366.203 L
cp
f
GR
GS
[0.75 0 0 0.75 0 0] CT
10.0 ML
0.667 LW
N
1121.966 366.203 M
1121.966 354.071 L
1151.709 354.071 L
1151.709 366.203 L
cp
S
GR
GS
[0.75 0 0 0.75 0 0] CT
0.149 GC
10.0 ML
0.667 LW
N
1118 370 M
1118 334 L
1234 334 L
1234 370 L
cp
S
GR
%%Trailer
%%Pages: 1
%%EOF
