{
	"coord": {
		"lon": 121.49,
		"lat": 31.23
	},
	"weather": [{
		"id": 800,
		"main": "Clear",
		"description": "clear sky",
		"icon": "01d"
	}],
	"base": "stations",
	"main": {
		"temp": 304.69,
		"pressure": 1003,
		"humidity": 66,
		"temp_min": 303.71,
		"temp_max": 305.15
	},
	"visibility": 10000,
	"wind": {
		"speed": 5,
		"deg": 210
	},
	"clouds": {
		"all": 0
	},
	"dt": 1563843467,
	"sys": {
		"type": 1,
		"id": 9659,
		"message": 0.006,
		"country": "CN",
		"sunrise": 1563829470,
		"sunset": 1563879368
	},
	"timezone": 28800,
	"id": 1796236,
	"name": "Shanghai",
	"cod": 200
}