{
	"cnt": 3,
	"list": [{
			"coord": {
				"lon": 37.62,
				"lat": 55.75
			},
			"sys": {
				"country": "RU",
				"timezone": 10800,
				"sunrise": 1563758168,
				"sunset": 1563818124
			},
			"weather": [{
				"id": 520,
				"main": "Rain",
				"description": "light intensity shower rain",
				"icon": "09d"
			}],
			"main": {
				"temp": 23.49,
				"pressure": 1016,
				"humidity": 73,
				"temp_min": 21,
				"temp_max": 26
			},
			"visibility": 10000,
			"wind": {
				"speed": 4,
				"deg": 190
			},
			"clouds": {
				"all": 75
			},
			"dt": 1563797340,
			"id": 524901,
			"name": "Moscow"
		},
		{
			"coord": {
				"lon": 30.52,
				"lat": 50.43
			},
			"sys": {
				"country": "UA",
				"timezone": 10800,
				"sunrise": 1563761475,
				"sunset": 1563818226
			},
			"weather": [{
				"id": 802,
				"main": "Clouds",
				"description": "scattered clouds",
				"icon": "03d"
			}],
			"main": {
				"temp": 23.46,
				"pressure": 1016,
				"humidity": 69,
				"temp_min": 21,
				"temp_max": 26.67
			},
			"visibility": 10000,
			"wind": {
				"speed": 5,
				"deg": 300
			},
			"clouds": {
				"all": 40
			},
			"dt": 1563797346,
			"id": 703448,
			"name": "Kiev"
		},
		{
			"coord": {
				"lon": -0.13,
				"lat": 51.51
			},
			"sys": {
				"country": "GB",
				"timezone": 3600,
				"sunrise": 1563768552,
				"sunset": 1563825861
			},
			"weather": [{
				"id": 804,
				"main": "Clouds",
				"description": "overcast clouds",
				"icon": "04d"
			}],
			"main": {
				"temp": 24.62,
				"pressure": 1022,
				"humidity": 69,
				"temp_min": 21.67,
				"temp_max": 27.22
			},
			"visibility": 10000,
			"wind": {
				"speed": 5.1,
				"deg": 230
			},
			"clouds": {
				"all": 90
			},
			"dt": 1563797358,
			"id": 2643743,
			"name": "London"
		},{
			"coord": {
				"lon": 110.34,
				"lat": 20.04
			},
			"weather": [{
				"id": 802,
				"main": "Clouds",
				"description": "scattered clouds",
				"icon": "03n"
			}],
			"base": "stations",
			"main": {
				"temp": 301.15,
				"pressure": 1003,
				"humidity": 78,
				"temp_min": 301.15,
				"temp_max": 301.15
			},
			"visibility": 10000,
			"wind": {
				"speed": 2,
				"deg": 180
			},
			"clouds": {
				"all": 40
			},
			"dt": 1563883167,
			"sys": {
				"type": 1,
				"id": 9635,
				"message": 0.0057,
				"country": "CN",
				"sunrise": 1563833417,
				"sunset": 1563880774
			},
			"timezone": 28800,
			"id": 1809078,
			"name": "Haikou",
			"cod": 200
		}
	]
}