{
    "name":"Page with three regions",
    "description":"Page with three regions",
    "attribute_definition_groups": [
      {
          "id": "printMyString",
          "name": "Print MY String",
          "description": "Print My String",
          "attribute_definitions": [
              {
                  "id": "mystring",
                  "name": "My String",
                  "description": "My String",
                  "type": "string",
                  "required": false
              }
          ]
      },
      {
        "id": "printMyImage",
        "name": "Print MY Image",
        "description": "Print My Image",
        "attribute_definitions": [
            {
                "id": "myimage",
                "name": "My Image",
                "description": "My Image",
                "type": "image",
                "required": false
            }
        ]
    }
  ],    
    "region_definitions":[
      {
        "id":"region1",
        "name":"Region 1",
        "max_components": 2
      },
      {
        "id":"region2",
        "name":"Region 2"
      },
      {
        "id":"region3",
        "name":"Region 3"
      }
    ]
}