{
    "hooks": [
        {
            "name": "test",
            "script": "./cartridge/scripts/hooks/test"
        },
        {
            "name": "createObjectProduct",
            "script": "./cartridge/scripts/hooks/createObjectProduct"
        }
    ]
}