# Room Types csv file
# Id                 ,Description,Rate,Capacity
1                    ,SINGLE     ,100 ,1
2                    ,DOUBLE     ,150 ,2
3                    ,TWIN       ,170 ,2
4                    ,TRIPLE     ,200 ,3
5                    ,QUAD       ,250 ,4
