<svg width="32" height="32" viewBox="0 0 32 32" fill="none" xmlns="http://www.w3.org/2000/svg">
    <path d="M27.8901 15.7955C26.671 13.726 24.9329 12.0105 22.8475 10.8187C20.7622 9.6269 18.4019 9 16 9C13.5981 9 11.2378 9.6269 9.15248 10.8187C7.06714 12.0105 5.32898 13.726 4.10986 15.7955C4.03792 15.9182 4 16.0579 4 16.2002C4 16.3425 4.03792 16.4822 4.10986 16.6049C5.32898 18.6744 7.06714 20.3899 9.15248 21.5817C11.2378 22.7735 13.5981 23.4004 16 23.4004C18.4019 23.4004 20.7622 22.7735 22.8475 21.5817C24.9329 20.3899 26.671 18.6744 27.8901 16.6049C27.9621 16.4822 28 16.3425 28 16.2002C28 16.0579 27.9621 15.9182 27.8901 15.7955ZM16 21.8002C13.9579 21.7982 11.9489 21.2846 10.1564 20.3064C8.36387 19.3282 6.84497 17.9165 5.73841 16.2002C6.84349 14.4826 8.36207 13.0698 10.1549 12.0914C11.9478 11.113 13.9576 10.6003 16 10.6003C18.0424 10.6003 20.0522 11.113 21.8451 12.0914C23.6379 13.0698 25.1565 14.4826 26.2616 16.2002C25.155 17.9165 23.6361 19.3282 21.8436 20.3064C20.0511 21.2846 18.0421 21.7982 16 21.8002ZM16 12.2003C15.2089 12.2003 14.4355 12.4348 13.7777 12.8744C13.1199 13.3139 12.6073 13.9386 12.3045 14.6695C12.0018 15.4004 11.9226 16.2047 12.0769 16.9806C12.2312 17.7565 12.6122 18.4692 13.1716 19.0286C13.731 19.588 14.4437 19.969 15.2196 20.1233C15.9956 20.2777 16.7998 20.1985 17.5307 19.8957C18.2616 19.593 18.8863 19.0803 19.3259 18.4225C19.7654 17.7647 20 16.9913 20 16.2002C19.9987 15.1397 19.5769 14.1231 18.827 13.3732C18.0772 12.6233 17.0605 12.2015 16 12.2003ZM16 18.6002C15.5253 18.6002 15.0613 18.4594 14.6666 18.1957C14.272 17.932 13.9644 17.5572 13.7827 17.1186C13.6011 16.6801 13.5535 16.1976 13.6461 15.732C13.7387 15.2665 13.9673 14.8388 14.303 14.5032C14.6386 14.1675 15.0662 13.939 15.5318 13.8464C15.9973 13.7537 16.4799 13.8013 16.9184 13.9829C17.357 14.1646 17.7318 14.4722 17.9955 14.8669C18.2592 15.2615 18.4 15.7255 18.4 16.2002C18.3993 16.8365 18.1462 17.4466 17.6963 17.8965C17.2463 18.3464 16.6363 18.5995 16 18.6002Z"
          fill="#6899CE"/>
</svg>
