# Rooms csv file
# Number        ,Room Type,Extra Info
1               ,1        ,"15m2, minibar"
2               ,2        ,"20m2, aer conditionat, minibar"
3               ,3        ,"22m2, aer conditionat, minibar, balcon"
4               ,4        ,"35m2, aer conditionat, minibar"
5               ,5        ,"50m2, aer conditionat, minibar, balcon"
11              ,1        ,"15m2, minibar, balcon"
12              ,2        ,"20m2, aer conditionat, minibar"
13              ,3        ,"22m2, aer conditionat, minibar, balcon"
14              ,4        ,"35m2, aer conditionat, minibar"
15              ,5        ,"50m2, aer conditionat, minibar, balcon"
21              ,1        ,"15m2, minibar, balcon"
22              ,2        ,"20m2, aer conditionat, minibar"
23              ,3        ,"22m2, aer conditionat, minibar, balcon"
24              ,4        ,"35m2, aer conditionat, minibar"
25              ,5        ,"50m2, aer conditionat, minibar, balcon"
31              ,1        ,"15m2, minibar, balcon"
32              ,2        ,"20m2, aer conditionat, minibar"
33              ,3        ,"22m2, aer conditionat, minibar, balcon"
34              ,4        ,"35m2, aer conditionat, minibar"
35              ,5        ,"50m2, aer conditionat, minibar, balcon"
