<svg width="27" height="19" viewBox="0 0 27 19" fill="none" xmlns="http://www.w3.org/2000/svg">
    <path d="M24.3722 7.44974V7.42087V3.06044C24.3722 1.0968 22.9861 0.374878 21.6866 0.374878H5.22674C3.92727 0.374878 2.54118 1.06793 2.54118 3.06044V7.42087V7.44974C1.24171 7.59413 0 8.46044 0 10.453V13.8604C0 14.438 0.462032 14.9 1.03957 14.9H1.3861V17.5856C1.3861 18.1631 1.84813 18.6251 2.42567 18.6251H3.40749C3.98503 18.6251 4.44706 18.1631 4.44706 17.5856V14.8711H22.5529V17.5856C22.5529 18.1631 23.015 18.6251 23.5925 18.6251H24.5743C25.1519 18.6251 25.6139 18.1631 25.6139 17.5856V14.8711H25.9604C26.538 14.8711 27 14.4091 27 13.8316V10.453C26.9134 8.46044 25.6717 7.59413 24.3722 7.44974ZM3.52299 3.06044H3.58075C3.58075 1.70322 4.47594 1.41445 5.22674 1.41445H21.6866C22.4374 1.41445 23.3326 1.70322 23.3326 3.06044V7.42087H22.5529V4.93744C22.5529 4.3599 22.0909 3.89787 21.5134 3.89787H15.1604C14.5829 3.89787 14.1209 4.3599 14.1209 4.93744V7.42087H12.908V4.93744C12.908 4.3599 12.446 3.89787 11.8684 3.89787H5.51551C4.93797 3.89787 4.47594 4.3599 4.47594 4.93744V7.42087H3.52299V3.06044ZM21.5134 4.93744V7.42087H15.1604V4.93744H21.5134ZM11.9262 4.93744V7.42087H5.57326V4.93744H11.9262ZM3.37861 17.5856H2.39679V14.8711H3.37861V17.5856ZM24.5166 17.5856H23.5348V14.8711H24.5166V17.5856ZM25.8738 13.8604H24.5166H23.5348H3.37861H2.39679H1.0107V12.33H25.8738V13.8604ZM25.8738 11.2904H1.0107V10.453C1.0107 8.72033 2.28128 8.46044 3.00321 8.46044H3.55187H5.54438H11.8973H15.1604H21.5134H23.3326H23.8813C24.6321 8.46044 25.8738 8.72033 25.8738 10.453V11.2904Z"
          fill="#303B4E"/>
</svg>
