Entity,Code,Year,Electricity from hydro (TWh)
Afghanistan,AFG,2019,0.84
Africa,,2019,132.7347905
Albania,ALB,2019,5.15394
Algeria,DZA,2019,0.10644
American Samoa,ASM,2019,0
Angola,AGO,2019,9.84988
Antarctica,ATA,2019,0
Antigua and Barbuda,ATG,2019,0
Argentina,ARG,2019,27.33489
Armenia,ARM,2019,2.34729
Aruba,ABW,2019,0
Asia Pacific,,2019,1783.6566280000002
Australia,AUS,2019,15.53805
Austria,AUT,2019,41.63827012
Azerbaijan,AZE,2019,1.54935
Bahamas,BHS,2019,0
Bahrain,BHR,2019,0
Bangladesh,BGD,2019,0.82
Barbados,BRB,2019,0
Belarus,BLR,2019,0.34452
Belgium,BEL,2019,0.306045283
Belize,BLZ,2019,0.29502
Benin,BEN,2019,0
Bermuda,BMU,2019,0
Bhutan,BTN,2019,6.60833333333333
Bolivia,BOL,2019,3.22047
Bosnia and Herzegovina,BIH,2019,6.02019
Botswana,BWA,2019,0
Brazil,BRA,2019,393.898
British Virgin Islands,VGB,2019,0
Brunei,BRN,2019,0
Bulgaria,BGR,2019,2.93612544699999
Burkina Faso,BFA,2019,0.139666666666666
Burundi,BDI,2019,0.22
CIS,,2019,248.35943199999997
Cambodia,KHM,2019,4.03
Cameroon,CMR,2019,5.34
Canada,CAN,2019,377.97903
Cayman Islands,CYM,2019,0
Central African Republic,CAF,2019,0.15
Central America,,2019,22.63960862
Chad,TCD,2019,0
Chile,CHL,2019,20.66526
China,CHN,2019,1302.1
Colombia,COL,2019,53.98668
Comoros,COM,2019,0.0004
Congo,COG,2019,1.27314666666666
Cook Islands,COK,2019,0
Costa Rica,CRI,2019,7.74873
Croatia,HRV,2019,5.865936
Cuba,CUB,2019,0.177333333333333
Cyprus,CYP,2019,0
Czechia,CZE,2019,1.803642325
Democratic Republic of Congo,COD,2019,10.9678266666666
Denmark,DNK,2019,0.014862
Djibouti,DJI,2019,0
Dominica,DMA,2019,0.02
Dominican Republic,DOM,2019,1.053
EU-27,,2019,324.157234012
EU27+1,,2019,330.015494617
Eastern Africa,,2019,68.85537134
Ecuador,ECU,2019,24.41835
Egypt,EGY,2019,12.5566799999999
El Salvador,SLV,2019,1.442
Equatorial Guinea,GNQ,2019,0.58641
Eritrea,ERI,2019,0
Estonia,EST,2019,0.00959794199999999
Ethiopia,ETH,2019,13.9914266666666
Europe,,2019,632.5383017000001
Europe (other),,2019,34.06605012
Falkland Islands,FLK,2019,0
Faroe Islands,,2019,0.102
Fiji,FJI,2019,0.567
Finland,FIN,2019,12.22515049
France,FRA,2019,57.284601
French Guiana,GUF,2019,0.553
French Polynesia,PYF,2019,0.18
Gabon,GAB,2019,0.886319999999999
Gambia,GMB,2019,0
Georgia,GEO,2019,8.84268
Germany,DEU,2019,19.7
Ghana,GHA,2019,6.01344
Gibraltar,GIB,2019,0
Greece,GRC,2019,4.276328056
Greenland,GRL,2019,0.412093333333333
Grenada,GRD,2019,0
Guadeloupe,GLP,2019,0
Guam,GUM,2019,0
Guatemala,GTM,2019,4.43817
Guinea,GIN,2019,0.694365333333333
Guinea-Bissau,GNB,2019,0
Guyana,GUY,2019,0
Haiti,HTI,2019,0.23265
Honduras,HND,2019,3.53350666666666
Hong Kong,HKG,2019,0
Hungary,HUN,2019,0.241704858
Iceland,ISL,2019,13.32441
India,IND,2019,161.74087
Indonesia,IDN,2019,20.94939
Iran,IRN,2019,30.07125
Iraq,IRQ,2019,2.453
Ireland,IRL,2019,0.885512096
Israel,ISR,2019,0.0002
Italy,ITA,2019,46.8772893439999
Jamaica,JAM,2019,0.193333333333333
Japan,JPN,2019,79.81974
Jordan,JOR,2019,0.0130266666666666
Kazakhstan,KAZ,2019,9.84258
Kenya,KEN,2019,3.173
Kiribati,KIR,2019,0
Kosovo,OWID_KOS,2019,0.2079
Kuwait,KWT,2019,0
Kyrgyzstan,KGZ,2019,13.70556
Laos,LAO,2019,19.33
Latvia,LVA,2019,2.108003672
Lebanon,LBN,2019,0.30136
Lesotho,LSO,2019,0.540835333333333
Liberia,LBR,2019,0
Libya,LBY,2019,0
Lithuania,LTU,2019,0.352800905999999
Luxembourg,LUX,2019,0.092778
Macau,,2019,0
Madagascar,MDG,2019,0.96888
Malawi,MWI,2019,1.156765
Malaysia,MYS,2019,26.73
Maldives,MDV,2019,0
Mali,MLI,2019,1.44309
Malta,MLT,2019,0
Martinique,MTQ,2019,0
Mauritania,MRT,2019,0.2
Mauritius,MUS,2019,0.124666666666666
Mexico,MEX,2019,23.84514
Middle Africa,,2019,27.38665085
Middle East,,2019,33.29686612
Moldova,MDA,2019,0.29799
Mongolia,MNG,2019,0.09273
Montenegro,MNE,2019,2.29716
Montserrat,MSR,2019,0
Morocco,MAR,2019,1.63746
Mozambique,MOZ,2019,12.6973866666666
Namibia,NAM,2019,1.01441333333333
Nauru,NRU,2019,0
Nepal,NPL,2019,5.32602666666666
Netherlands,NLD,2019,0.074182
Netherlands Antilles,ANT,2019,0
New Caledonia,NCL,2019,0.309515333333333
New Zealand,NZL,2019,25.32717
Nicaragua,NIC,2019,0.445333333333333
Niger,NER,2019,0
Nigeria,NGA,2019,6.63663
Niue,NIU,2019,0
North America,,2019,676.9255853999999
North Korea,PRK,2019,13.65
North Macedonia,MKD,2019,1.1636739999999999
Norway,NOR,2019,123.66288
Oman,OMN,2019,0
Other Asia & Pacific,,2019,63.18515514
Other CIS,,2019,35.60478256
Other Caribbean,,2019,1.5296031819999998
Other Middle East,,2019,1.832839272
Other Northern Africa,,2019,0.06589
Other South America,,2019,62.25754622
Other Southern Africa,,2019,1.7211
Pakistan,PAK,2019,43.1464919999999
Palestine,PSE,2019,0
Panama,PAN,2019,8.30333333333333
Papua New Guinea,PNG,2019,0.8
Paraguay,PRY,2019,48.93471
Peru,PER,2019,31.25529
Philippines,PHL,2019,7.94475
Poland,POL,2019,1.92782699499999
Portugal,PRT,2019,9.210954093
Puerto Rico,PRI,2019,0.032412
Qatar,QAT,2019,0
Reunion,REU,2019,0.601
Romania,ROU,2019,15.655264995
Russia,RUS,2019,192.43224
Rwanda,RWA,2019,0.346908
Saint Helena,SHN,2019,0
Saint Kitts and Nevis,KNA,2019,0
Saint Lucia,LCA,2019,0
Saint Pierre and Miquelon,SPM,2019,0
Saint Vincent and the Grenadines,VCT,2019,0.024
Samoa,WSM,2019,0.0467519999999999
Sao Tome and Principe,STP,2019,0.00666666666666666
Saudi Arabia,SAU,2019,0
Senegal,SEN,2019,0.365199999999999
Serbia,SRB,2019,10.07028
Seychelles,SYC,2019,0
Sierra Leone,SLE,2019,0.18
Singapore,SGP,2019,0
Slovakia,SVK,2019,4.572830786
Slovenia,SVN,2019,4.620329818
Solomon Islands,SLB,2019,0
Somalia,SOM,2019,0
South & Central America,,2019,714.7033878999999
South Africa,ZAF,2019,1.07613
South Korea,KOR,2019,2.74824
South Sudan,SSD,2019,0
Spain,ESP,2019,24.9088601599999
Sri Lanka,LKA,2019,6.47965333333333
Sudan,SDN,2019,9.96857333333333
Suriname,SUR,2019,1.16424
Sweden,SWE,2019,66.568337626
Switzerland,CHE,2019,37.6596
Syria,SYR,2019,0.858946666666666
Taiwan,TWN,2019,5.545
Tajikistan,TJK,2019,18.97731
Tanzania,TZA,2019,2.25321333333333
Thailand,THA,2019,6.36966
Togo,TGO,2016,0.20196
Togo,TGO,2019,0
Tonga,TON,2019,0
Trinidad and Tobago,TTO,2019,0
Tunisia,TUN,2019,0.06534
Turkey,TUR,2019,87.99714
Turkmenistan,TKM,2019,0.0003
Turks and Caicos Islands,TCA,2019,0
U.S. Pacific Islands,,2019,0
Uganda,UGA,2019,3.99927
Ukraine,UKR,2019,7.68735
United Arab Emirates,ARE,2019,0
United Kingdom,GBR,2019,5.858260605
United States,USA,2019,282.613
United States Virgin Islands,VIR,2019,0
Uruguay,URY,2019,8.02692
Uzbekistan,UZB,2019,5.45137333333333
Vanuatu,VUT,2019,0
Venezuela,VEN,2019,52.0413333333333
Vietnam,VNM,2019,67.3932105
Western Africa,,2019,19.1405642
Western Sahara,ESH,2019,0
World,OWID_WRL,2019,4261.24102345033
Yemen,YEM,2019,0
Zambia,ZMB,2019,13.7724266666666
Zimbabwe,ZWE,2019,5.02
