Entity,Code,Year,Renewables (% sub energy)
Algeria,DZA,2005,0.408
Argentina,ARG,2005,13.991
Australia,AUS,2005,3.971
Austria,AUT,2005,26.547
Azerbaijan,AZE,2005,4.872
Bangladesh,BGD,2005,1.067
Belarus,BLR,2005,0.035
Belgium,BEL,2005,0.741
Brazil,BRA,2005,41.76
Bulgaria,BGR,2005,4.956
Canada,CAN,2005,27.285
Chile,CHL,2005,21.221
China,CHN,2005,5.219
Colombia,COL,2005,33.583
Croatia,HRV,2005,17.575
Cyprus,CYP,2005,0.007
Czechia,CZE,2005,1.586
Denmark,DNK,2005,11.447
Ecuador,ECU,2005,15.73
Egypt,EGY,2005,5.024
Estonia,EST,2005,0.47
Finland,FIN,2005,17.579
France,FRA,2005,5.077
Germany,DEU,2005,4.782
Greece,GRC,2005,4.261
Hong Kong,HKG,2005,0
Hungary,HUN,2005,1.637
Iceland,ISL,2005,67.457
India,IND,2005,6.293
Indonesia,IDN,2005,3.247
Iran,IRN,2005,1.981
Iraq,IRQ,2005,4.356
Ireland,IRL,2005,2.694
Israel,ISR,2005,0.041
Italy,ITA,2005,6.053
Japan,JPN,2005,4.454
Kazakhstan,KAZ,2005,4.008
Kuwait,KWT,2005,0
Latvia,LVA,2005,19.814
Lithuania,LTU,2005,1.332
Luxembourg,LUX,2005,1.071
Malaysia,MYS,2005,2.186
Mexico,MEX,2005,5.193
Morocco,MAR,2005,1.958
Netherlands,NLD,2005,1.811
New Zealand,NZL,2005,33.092
North Macedonia,MKD,2005,12.43
Norway,NOR,2005,68.394
Oman,OMN,2005,0
Pakistan,PAK,2005,12.889
Peru,PER,2005,30.458
Philippines,PHL,2005,15.773
Poland,POL,2005,1.029
Portugal,PRT,2005,7.504
Qatar,QAT,2005,0
Romania,ROU,2005,11.964
Russia,RUS,2005,6.235
Saudi Arabia,SAU,2005,0
Singapore,SGP,2005,0.234
Slovakia,SVK,2005,5.49
Slovenia,SVN,2005,11.409
South Africa,ZAF,2005,0.37
South Korea,KOR,2005,0.423
Spain,ESP,2005,6.464
Sri Lanka,LKA,2005,16.257
Sweden,SWE,2005,33.319
Switzerland,CHE,2005,26.188
Taiwan,TWN,2005,1.288
Thailand,THA,2005,2.003
Trinidad and Tobago,TTO,2005,0.036
Turkey,TUR,2005,10.801
Turkmenistan,TKM,2005,0.005
Ukraine,UKR,2005,2.094
United Arab Emirates,ARE,2005,0
United Kingdom,GBR,2005,1.714
United States,USA,2005,3.962
Uzbekistan,UZB,2005,3.312
Venezuela,VEN,2005,24.336
Vietnam,VNM,2005,12.307
World,OWID_WRL,2005,7.135
