     -0.06750000      0.06750000      0.00000000      0.00000000      0.00000000      0.00000000    -74.94725200   -105.68579954
     -0.06500000      0.06500000      0.00000000      0.00000000      0.00000000      0.00000000    -75.23364100   -105.61762460
     -0.06250000      0.06250000      0.00000000      0.00000000      0.00000000      0.00000000    -75.46670600   -105.55353400
     -0.06000000      0.06000000      0.00000000      0.00000000      0.00000000      0.00000000    -75.67565800   -105.49336460
     -0.05750000      0.05750000      0.00000000      0.00000000      0.00000000      0.00000000    -75.86423700   -105.43696323
     -0.05500000      0.05500000      0.00000000      0.00000000      0.00000000      0.00000000    -76.03589900   -105.38418621
     -0.05250000      0.05250000      0.00000000      0.00000000      0.00000000      0.00000000    -76.19488000   -105.33489886
     -0.05000000      0.05000000      0.00000000      0.00000000      0.00000000      0.00000000    -76.34325900   -105.28897509
     -0.04750000      0.04750000      0.00000000      0.00000000      0.00000000      0.00000000    -76.48202300   -105.24629691
     -0.04500000      0.04500000      0.00000000      0.00000000      0.00000000      0.00000000    -76.61150700   -105.20675417
     -0.04250000      0.04250000      0.00000000      0.00000000      0.00000000      0.00000000    -76.73216600   -105.17024412
     -0.04000000      0.04000000      0.00000000      0.00000000      0.00000000      0.00000000    -76.84432100   -105.13667119
     -0.03750000      0.03750000      0.00000000      0.00000000      0.00000000      0.00000000    -76.94872000   -105.10594662
     -0.03500000      0.03500000      0.00000000      0.00000000      0.00000000      0.00000000    -77.04566200   -105.07798825
     -0.03000000      0.03000000      0.00000000      0.00000000      0.00000000      0.00000000    -77.21933000   -105.03007297
     -0.02750000      0.02750000      0.00000000      0.00000000      0.00000000      0.00000000    -77.29699100   -105.00998261
     -0.02500000      0.02500000      0.00000000      0.00000000      0.00000000      0.00000000    -77.36914700   -104.99239117
     -0.02000000      0.02000000      0.00000000      0.00000000      0.00000000      0.00000000    -77.49859300   -104.96450079
     -0.01750000      0.01750000      0.00000000      0.00000000      0.00000000      0.00000000    -77.55667500   -104.95411320
     -0.01500000      0.01500000      0.00000000      0.00000000      0.00000000      0.00000000    -77.61075200   -104.94604697
     -0.01250000      0.01250000      0.00000000      0.00000000      0.00000000      0.00000000    -77.66110800   -104.94027073
     -0.01000000      0.01000000      0.00000000      0.00000000      0.00000000      0.00000000    -77.70797400   -104.93675811
     -0.00750000      0.00750000      0.00000000      0.00000000      0.00000000      0.00000000    -77.75156100   -104.93548767
     -0.00500000      0.00500000      0.00000000      0.00000000      0.00000000      0.00000000    -77.79201700   -104.93644286
     -0.00300000      0.00300000      0.00000000      0.00000000      0.00000000      0.00000000    -77.82220800   -104.93880143
     -0.00200000      0.00200000      0.00000000      0.00000000      0.00000000      0.00000000    -77.83659600   -104.94051075
     -0.00100000      0.00100000      0.00000000      0.00000000      0.00000000      0.00000000    -77.85051600   -104.94257301
     -0.00050000      0.00050000      0.00000000      0.00000000      0.00000000      0.00000000    -77.85730100   -104.94373643
      0.00000000      0.00000000      0.00000000      0.00000000      0.00000000      0.00000000    -77.86396900   -104.94498803
      0.00050000     -0.00050000      0.00000000      0.00000000      0.00000000      0.00000000    -77.87052100   -104.94632781
      0.00100000     -0.00100000      0.00000000      0.00000000      0.00000000      0.00000000    -77.87695700   -104.94775577
      0.00200000     -0.00200000      0.00000000      0.00000000      0.00000000      0.00000000    -77.88948000   -104.95087631
      0.00300000     -0.00300000      0.00000000      0.00000000      0.00000000      0.00000000    -77.90153800   -104.95434983
      0.00500000     -0.00500000      0.00000000      0.00000000      0.00000000      0.00000000    -77.92425300   -104.96235726
      0.00750000     -0.00750000      0.00000000      0.00000000      0.00000000      0.00000000    -77.94996500   -104.97436038
      0.01000000     -0.01000000      0.00000000      0.00000000      0.00000000      0.00000000    -77.97261600   -104.98859046
      0.01250000     -0.01250000      0.00000000      0.00000000      0.00000000      0.00000000    -77.99205800   -105.00506445
      0.01500000     -0.01500000      0.00000000      0.00000000      0.00000000      0.00000000    -78.00809500   -105.02380414
      0.01750000     -0.01750000      0.00000000      0.00000000      0.00000000      0.00000000    -78.02048600   -105.04483624
      0.02000000     -0.02000000      0.00000000      0.00000000      0.00000000      0.00000000    -78.02893300   -105.06819240
      0.02250000     -0.02250000      0.00000000      0.00000000      0.00000000      0.00000000    -78.03308300   -105.09390932
      0.02500000     -0.02500000      0.00000000      0.00000000      0.00000000      0.00000000    -78.03253200   -105.12202882
      0.02750000     -0.02750000      0.00000000      0.00000000      0.00000000      0.00000000    -78.02678900   -105.15259796
      0.03000000     -0.03000000      0.00000000      0.00000000      0.00000000      0.00000000    -78.01531700   -105.18566916
      0.03250000     -0.03250000      0.00000000      0.00000000      0.00000000      0.00000000    -77.99749100   -105.22130034
      0.03500000     -0.03500000      0.00000000      0.00000000      0.00000000      0.00000000    -77.97259600   -105.25955505
      0.03750000     -0.03750000      0.00000000      0.00000000      0.00000000      0.00000000    -77.93985600   -105.30050268
      0.04000000     -0.04000000      0.00000000      0.00000000      0.00000000      0.00000000    -77.89835700   -105.34421861
      0.04250000     -0.04250000      0.00000000      0.00000000      0.00000000      0.00000000    -77.84711500   -105.39078443
      0.04500000     -0.04500000      0.00000000      0.00000000      0.00000000      0.00000000    -77.78501500   -105.44028821
      0.04750000     -0.04750000      0.00000000      0.00000000      0.00000000      0.00000000    -77.71082300   -105.49282468
      0.05000000     -0.05000000      0.00000000      0.00000000      0.00000000      0.00000000    -77.62316800   -105.54849559
      0.05250000     -0.05250000      0.00000000      0.00000000      0.00000000      0.00000000    -77.52052300   -105.60740992
      0.05500000     -0.05500000      0.00000000      0.00000000      0.00000000      0.00000000    -77.40120100   -105.66968431
      0.05750000     -0.05750000      0.00000000      0.00000000      0.00000000      0.00000000    -77.26332300   -105.73544332
      0.06000000     -0.06000000      0.00000000      0.00000000      0.00000000      0.00000000    -77.10481800   -105.80481991
      0.06250000     -0.06250000      0.00000000      0.00000000      0.00000000      0.00000000    -76.92339300   -105.87795581
      0.06500000     -0.06500000      0.00000000      0.00000000      0.00000000      0.00000000    -76.71647600   -105.95500205
      0.06750000     -0.06750000      0.00000000      0.00000000      0.00000000      0.00000000    -76.48122300   -106.03611940
      0.07000000     -0.07000000      0.00000000      0.00000000      0.00000000      0.00000000    -76.21448000   -106.12147896
