5.179429152035143125e+14
1.382572840603034219e+14
3.804647916480485938e+13
3.418017812117678125e+13
2.716710849551834375e+13
1.849262397788091406e+13
1.331608410899292773e+13
1.247731807561620703e+13
1.115686814036207422e+13
1.011227336933656836e+13
7.487256327923316406e+12
5.860641190897933594e+12
5.222081539303477539e+12
4.429495750293981445e+12
3.105768240415051270e+12
2.458812016648999023e+12
2.056755169362004395e+12
1.718357235100954346e+12
1.633570680184633301e+12
1.596659353391302490e+12
1.282148367127363037e+12
1.215681757979832764e+12
1.032315145792743042e+12
9.630741387272698975e+11
8.411569002839240723e+11
7.987556235240749512e+11
6.703307822106535645e+11
5.845508003172700195e+11
5.498484875020976562e+11
5.375497266659530029e+11
5.225158496361830444e+11
4.931779663119967041e+11
4.197052489820269775e+11
4.117794150579475098e+11
3.591981257064816895e+11
3.055961684187263184e+11
2.978368713050286255e+11
2.811238131368483887e+11
2.585954638194147644e+11
2.422899310626752319e+11
2.198956497447062378e+11
2.059124410224273376e+11
1.923343250351091309e+11
1.835979422015890503e+11
1.652568153198423462e+11
1.630440334320985413e+11
1.462148301881019592e+11
1.366714378246092377e+11
1.340095752086533966e+11
1.221239027398022461e+11
