{
  "canvasWidth": 925,
  "canvasHeight": 300,
  "timeStart": 0,
  "timeEnd": 1,
  "timeUnit": 20,
  "pixelUnit": 80,
  "syncFactor": 0.6,
  "noSyncFactor": 0.4,
  "localeLanguage": "CRO",
  "resultPrecision": 3
}