<?xml version="1.0" encoding="UTF-8" standalone="no"?>
<!-- Created with Inkscape (http://www.inkscape.org/) -->

<svg
   xmlns:dc="http://purl.org/dc/elements/1.1/"
   xmlns:cc="http://creativecommons.org/ns#"
   xmlns:rdf="http://www.w3.org/1999/02/22-rdf-syntax-ns#"
   xmlns:svg="http://www.w3.org/2000/svg"
   xmlns="http://www.w3.org/2000/svg"
   xmlns:sodipodi="http://sodipodi.sourceforge.net/DTD/sodipodi-0.dtd"
   xmlns:inkscape="http://www.inkscape.org/namespaces/inkscape"
   width="744.09448819"
   height="1052.3622047"
   id="svg2"
   version="1.1"
   inkscape:version="0.91 r13725"
   sodipodi:docname="usporedba_ob.svg">
  <defs
     id="defs4">
    <marker
       inkscape:stockid="DotM"
       orient="auto"
       refY="0.0"
       refX="0.0"
       id="marker8854"
       style="overflow:visible"
       inkscape:isstock="true">
      <path
         id="path8856"
         d="M -2.5,-1.0 C -2.5,1.7600000 -4.7400000,4.0 -7.5,4.0 C -10.260000,4.0 -12.5,1.7600000 -12.5,-1.0 C -12.5,-3.7600000 -10.260000,-6.0 -7.5,-6.0 C -4.7400000,-6.0 -2.5,-3.7600000 -2.5,-1.0 z "
         style="fill-rule:evenodd;stroke:#000000;stroke-width:1pt;stroke-opacity:1;fill:#000000;fill-opacity:1"
         transform="scale(0.4) translate(7.4, 1)" />
    </marker>
    <marker
       inkscape:stockid="DotM"
       orient="auto"
       refY="0.0"
       refX="0.0"
       id="marker8814"
       style="overflow:visible"
       inkscape:isstock="true">
      <path
         id="path8816"
         d="M -2.5,-1.0 C -2.5,1.7600000 -4.7400000,4.0 -7.5,4.0 C -10.260000,4.0 -12.5,1.7600000 -12.5,-1.0 C -12.5,-3.7600000 -10.260000,-6.0 -7.5,-6.0 C -4.7400000,-6.0 -2.5,-3.7600000 -2.5,-1.0 z "
         style="fill-rule:evenodd;stroke:#000000;stroke-width:1pt;stroke-opacity:1;fill:#000000;fill-opacity:1"
         transform="scale(0.4) translate(7.4, 1)" />
    </marker>
    <marker
       inkscape:isstock="true"
       style="overflow:visible"
       id="marker8760"
       refX="0.0"
       refY="0.0"
       orient="auto"
       inkscape:stockid="DotM"
       inkscape:collect="always">
      <path
         transform="scale(0.4) translate(7.4, 1)"
         style="fill-rule:evenodd;stroke:#000000;stroke-width:1pt;stroke-opacity:1;fill:#000000;fill-opacity:1"
         d="M -2.5,-1.0 C -2.5,1.7600000 -4.7400000,4.0 -7.5,4.0 C -10.260000,4.0 -12.5,1.7600000 -12.5,-1.0 C -12.5,-3.7600000 -10.260000,-6.0 -7.5,-6.0 C -4.7400000,-6.0 -2.5,-3.7600000 -2.5,-1.0 z "
         id="path8762" />
    </marker>
    <marker
       inkscape:isstock="true"
       style="overflow:visible"
       id="marker8732"
       refX="0.0"
       refY="0.0"
       orient="auto"
       inkscape:stockid="DotM">
      <path
         transform="scale(0.4) translate(7.4, 1)"
         style="fill-rule:evenodd;stroke:#000000;stroke-width:1pt;stroke-opacity:1;fill:#000000;fill-opacity:1"
         d="M -2.5,-1.0 C -2.5,1.7600000 -4.7400000,4.0 -7.5,4.0 C -10.260000,4.0 -12.5,1.7600000 -12.5,-1.0 C -12.5,-3.7600000 -10.260000,-6.0 -7.5,-6.0 C -4.7400000,-6.0 -2.5,-3.7600000 -2.5,-1.0 z "
         id="path8734" />
    </marker>
    <marker
       inkscape:isstock="true"
       style="overflow:visible"
       id="marker8710"
       refX="0.0"
       refY="0.0"
       orient="auto"
       inkscape:stockid="DotM">
      <path
         transform="scale(0.4) translate(7.4, 1)"
         style="fill-rule:evenodd;stroke:#000000;stroke-width:1pt;stroke-opacity:1;fill:#000000;fill-opacity:1"
         d="M -2.5,-1.0 C -2.5,1.7600000 -4.7400000,4.0 -7.5,4.0 C -10.260000,4.0 -12.5,1.7600000 -12.5,-1.0 C -12.5,-3.7600000 -10.260000,-6.0 -7.5,-6.0 C -4.7400000,-6.0 -2.5,-3.7600000 -2.5,-1.0 z "
         id="path8712" />
    </marker>
    <marker
       inkscape:stockid="DotM"
       orient="auto"
       refY="0.0"
       refX="0.0"
       id="DotM"
       style="overflow:visible"
       inkscape:isstock="true"
       inkscape:collect="always">
      <path
         id="path8498"
         d="M -2.5,-1.0 C -2.5,1.7600000 -4.7400000,4.0 -7.5,4.0 C -10.260000,4.0 -12.5,1.7600000 -12.5,-1.0 C -12.5,-3.7600000 -10.260000,-6.0 -7.5,-6.0 C -4.7400000,-6.0 -2.5,-3.7600000 -2.5,-1.0 z "
         style="fill-rule:evenodd;stroke:#000000;stroke-width:1pt;stroke-opacity:1;fill:#000000;fill-opacity:1"
         transform="scale(0.4) translate(7.4, 1)" />
    </marker>
  </defs>
  <sodipodi:namedview
     id="base"
     pagecolor="#ffffff"
     bordercolor="#666666"
     borderopacity="1.0"
     inkscape:pageopacity="0.0"
     inkscape:pageshadow="2"
     inkscape:zoom="1.7460214"
     inkscape:cx="256.65214"
     inkscape:cy="430.98103"
     inkscape:document-units="px"
     inkscape:current-layer="g3821-3-0-8-9"
     showgrid="false"
     inkscape:window-width="1842"
     inkscape:window-height="856"
     inkscape:window-x="75"
     inkscape:window-y="52"
     inkscape:window-maximized="0" />
  <metadata
     id="metadata7">
    <rdf:RDF>
      <cc:Work
         rdf:about="">
        <dc:format>image/svg+xml</dc:format>
        <dc:type
           rdf:resource="http://purl.org/dc/dcmitype/StillImage" />
        <dc:title />
      </cc:Work>
    </rdf:RDF>
  </metadata>
  <g
     inkscape:label="Layer 1"
     inkscape:groupmode="layer"
     id="layer1">
    <g
       transform="translate(-12.959404,-162.80267)"
       id="g3826-3">
      <rect
         ry="4.9675241"
         rx="2.1657565"
         y="413.30103"
         x="98.005569"
         height="48.597805"
         width="50.217731"
         id="rect2985-6"
         style="fill:none;stroke:#000000;stroke-width:1;stroke-miterlimit:4;stroke-dasharray:none;stroke-dashoffset:0;stroke-opacity:1" />
      <text
         sodipodi:linespacing="125%"
         id="text3755-7"
         y="444.45969"
         x="115.39487"
         style="font-style:normal;font-weight:normal;font-size:10px;line-height:125%;font-family:Sans;letter-spacing:0px;word-spacing:0px;fill:#000000;fill-opacity:1;stroke:none"
         xml:space="preserve"><tspan
           style="font-size:20px"
           y="444.45969"
           x="115.39487"
           id="tspan3757-5"
           sodipodi:role="line">&amp;</tspan></text>
    </g>
    <g
       transform="translate(-23.48892,-195.20122)"
       id="g3821-3">
      <text
         sodipodi:linespacing="125%"
         id="text3759-5"
         y="478.09811"
         x="210.5905"
         style="font-style:normal;font-weight:normal;font-size:10px;line-height:125%;font-family:Sans;letter-spacing:0px;word-spacing:0px;fill:#000000;fill-opacity:1;stroke:none"
         xml:space="preserve"><tspan
           style="font-size:20px"
           y="478.09811"
           x="210.5905"
           id="tspan3761-6"
           sodipodi:role="line">≥1</tspan></text>
      <rect
         ry="4.9675241"
         rx="2.1657565"
         y="446.50955"
         x="199.25099"
         height="48.597805"
         width="50.217731"
         id="rect2985-5-2"
         style="fill:none;stroke:#000000;stroke-width:1;stroke-miterlimit:4;stroke-dasharray:none;stroke-dashoffset:0;stroke-opacity:1" />
    </g>
    <g
       transform="translate(-11.544186,-80.937747)"
       id="g3826-3-9">
      <rect
         ry="4.9675241"
         rx="2.1657565"
         y="413.30103"
         x="98.005569"
         height="48.597805"
         width="50.217731"
         id="rect2985-6-1"
         style="fill:none;stroke:#000000;stroke-width:1;stroke-miterlimit:4;stroke-dasharray:none;stroke-dashoffset:0;stroke-opacity:1" />
      <text
         sodipodi:linespacing="125%"
         id="text3755-7-2"
         y="444.45969"
         x="115.39487"
         style="font-style:normal;font-weight:normal;font-size:10px;line-height:125%;font-family:Sans;letter-spacing:0px;word-spacing:0px;fill:#000000;fill-opacity:1;stroke:none"
         xml:space="preserve"><tspan
           style="font-size:20px"
           y="444.45969"
           x="115.39487"
           id="tspan3757-5-7"
           sodipodi:role="line">&amp;</tspan></text>
    </g>
    <g
       transform="translate(-22.073708,-113.33629)"
       id="g3821-3-0">
      <text
         sodipodi:linespacing="125%"
         id="text3759-5-9"
         y="478.09811"
         x="210.5905"
         style="font-style:normal;font-weight:normal;font-size:10px;line-height:125%;font-family:Sans;letter-spacing:0px;word-spacing:0px;fill:#000000;fill-opacity:1;stroke:none"
         xml:space="preserve"><tspan
           style="font-size:20px"
           y="478.09811"
           x="210.5905"
           id="tspan3761-6-3"
           sodipodi:role="line">≥1</tspan></text>
      <rect
         ry="4.9675241"
         rx="2.1657565"
         y="446.50955"
         x="199.25099"
         height="48.597805"
         width="50.217731"
         id="rect2985-5-2-6"
         style="fill:none;stroke:#000000;stroke-width:1;stroke-miterlimit:4;stroke-dasharray:none;stroke-dashoffset:0;stroke-opacity:1" />
    </g>
    <circle
       style="color:#000000;clip-rule:nonzero;display:inline;overflow:visible;visibility:visible;opacity:1;isolation:auto;mix-blend-mode:normal;color-interpolation:sRGB;color-interpolation-filters:linearRGB;solid-color:#000000;solid-opacity:1;fill:#fdffff;fill-opacity:0.49803922;fill-rule:nonzero;stroke:#000000;stroke-width:1;stroke-linecap:butt;stroke-linejoin:miter;stroke-miterlimit:4;stroke-dasharray:none;stroke-dashoffset:0;stroke-opacity:1;color-rendering:auto;image-rendering:auto;shape-rendering:auto;text-rendering:auto;enable-background:accumulate"
       id="path8178"
       cx="141.89403"
       cy="356.35126"
       r="4.8639975" />
    <circle
       style="color:#000000;clip-rule:nonzero;display:inline;overflow:visible;visibility:visible;opacity:1;isolation:auto;mix-blend-mode:normal;color-interpolation:sRGB;color-interpolation-filters:linearRGB;solid-color:#000000;solid-opacity:1;fill:#fdffff;fill-opacity:0.49803922;fill-rule:nonzero;stroke:#000000;stroke-width:1;stroke-linecap:butt;stroke-linejoin:miter;stroke-miterlimit:4;stroke-dasharray:none;stroke-dashoffset:0;stroke-opacity:1;color-rendering:auto;image-rendering:auto;shape-rendering:auto;text-rendering:auto;enable-background:accumulate"
       id="path8178-0"
       cx="232.24228"
       cy="357.06717"
       r="4.8639975" />
    <g
       transform="translate(65.033194,-197.05582)"
       id="g3821-3-6">
      <text
         sodipodi:linespacing="125%"
         id="text3759-5-2"
         y="478.09811"
         x="210.5905"
         style="font-style:normal;font-weight:normal;font-size:10px;line-height:125%;font-family:Sans;letter-spacing:0px;word-spacing:0px;fill:#000000;fill-opacity:1;stroke:none"
         xml:space="preserve"><tspan
           style="font-size:20px"
           y="478.09811"
           x="210.5905"
           id="tspan3761-6-6"
           sodipodi:role="line">=1</tspan></text>
      <rect
         ry="4.9675241"
         rx="2.1657565"
         y="446.50955"
         x="199.25099"
         height="48.597805"
         width="50.217731"
         id="rect2985-5-2-1"
         style="fill:none;stroke:#000000;stroke-width:1;stroke-miterlimit:4;stroke-dasharray:none;stroke-dashoffset:0;stroke-opacity:1" />
    </g>
    <g
       transform="translate(66.448404,-115.19089)"
       id="g3821-3-0-8">
      <text
         sodipodi:linespacing="125%"
         id="text3759-5-9-7"
         y="478.09811"
         x="210.5905"
         style="font-style:normal;font-weight:normal;font-size:10px;line-height:125%;font-family:Sans;letter-spacing:0px;word-spacing:0px;fill:#000000;fill-opacity:1;stroke:none"
         xml:space="preserve"><tspan
           style="font-size:20px"
           y="478.09811"
           x="210.5905"
           id="tspan3761-6-3-9"
           sodipodi:role="line">=1</tspan></text>
      <rect
         ry="4.9675241"
         rx="2.1657565"
         y="446.50955"
         x="199.25099"
         height="48.597805"
         width="50.217731"
         id="rect2985-5-2-6-2"
         style="fill:none;stroke:#000000;stroke-width:1;stroke-miterlimit:4;stroke-dasharray:none;stroke-dashoffset:0;stroke-opacity:1" />
    </g>
    <circle
       style="color:#000000;clip-rule:nonzero;display:inline;overflow:visible;visibility:visible;opacity:1;isolation:auto;mix-blend-mode:normal;color-interpolation:sRGB;color-interpolation-filters:linearRGB;solid-color:#000000;solid-opacity:1;fill:#fdffff;fill-opacity:0.49803922;fill-rule:nonzero;stroke:#000000;stroke-width:1;stroke-linecap:butt;stroke-linejoin:miter;stroke-miterlimit:4;stroke-dasharray:none;stroke-dashoffset:0;stroke-opacity:1;color-rendering:auto;image-rendering:auto;shape-rendering:auto;text-rendering:auto;enable-background:accumulate"
       id="path8178-0-0"
       cx="320.7644"
       cy="355.21255"
       r="4.8639975" />
    <g
       transform="translate(153.80644,-199.91947)"
       id="g3821-3-6-2">
      <text
         sodipodi:linespacing="125%"
         id="text3759-5-2-3"
         y="478.09811"
         x="218.5905"
         style="font-style:normal;font-weight:normal;font-size:10px;line-height:125%;font-family:Sans;letter-spacing:0px;word-spacing:0px;fill:#000000;fill-opacity:1;stroke:none"
         xml:space="preserve"><tspan
           style="font-size:20px"
           y="478.09811"
           x="218.5905"
           id="tspan3761-6-6-7"
           sodipodi:role="line">1</tspan></text>
      <rect
         ry="4.9675241"
         rx="2.1657565"
         y="446.50955"
         x="199.25099"
         height="48.597805"
         width="50.217731"
         id="rect2985-5-2-1-5"
         style="fill:none;stroke:#000000;stroke-width:1;stroke-miterlimit:4;stroke-dasharray:none;stroke-dashoffset:0;stroke-opacity:1" />
    </g>
    <g
       transform="translate(155.22165,-118.05454)"
       id="g3821-3-0-8-9">
      <text
         sodipodi:linespacing="125%"
         id="text3759-5-9-7-2"
         y="478.09811"
         x="216.5905"
         style="font-style:normal;font-weight:normal;font-size:10px;line-height:125%;font-family:Sans;letter-spacing:0px;word-spacing:0px;fill:#000000;fill-opacity:1;stroke:none"
         xml:space="preserve"><tspan
           style="font-size:20px"
           y="478.09811"
           x="216.5905"
           id="tspan3761-6-3-9-2"
           sodipodi:role="line">1</tspan></text>
      <rect
         ry="4.9675241"
         rx="2.1657565"
         y="446.50955"
         x="199.25099"
         height="48.597805"
         width="50.217731"
         id="rect2985-5-2-6-2-8"
         style="fill:none;stroke:#000000;stroke-width:1;stroke-miterlimit:4;stroke-dasharray:none;stroke-dashoffset:0;stroke-opacity:1" />
      <rect
         style="fill:none;stroke:#000000;stroke-width:1;stroke-miterlimit:4;stroke-dasharray:none;stroke-dashoffset:0;stroke-opacity:1"
         id="rect2985-62-3"
         width="50.217731"
         height="48.597805"
         x="135.15025"
         y="622.47644"
         rx="2.1657565"
         ry="4.9675241" />
      <text
         xml:space="preserve"
         style="font-style:normal;font-weight:normal;font-size:10px;line-height:125%;font-family:Sans;letter-spacing:0px;word-spacing:0px;fill:#000000;fill-opacity:1;stroke:none"
         x="152.53955"
         y="653.63513"
         id="text3755-9-1"
         sodipodi:linespacing="125%"><tspan
           sodipodi:role="line"
           id="tspan3757-1-9"
           x="152.53955"
           y="653.63513"
           style="font-size:20px">&amp;</tspan></text>
      <rect
         style="fill:none;stroke:#000000;stroke-width:1;stroke-miterlimit:4;stroke-dasharray:none;stroke-dashoffset:0;stroke-opacity:1"
         id="rect2985-62-3-4"
         width="50.217731"
         height="48.597805"
         x="135.15025"
         y="671.07428"
         rx="2.1657565"
         ry="4.9675241" />
      <text
         xml:space="preserve"
         style="font-style:normal;font-weight:normal;font-size:10px;line-height:125%;font-family:Sans;letter-spacing:0px;word-spacing:0px;fill:#000000;fill-opacity:1;stroke:none"
         x="152.53957"
         y="702.23291"
         id="text3755-9-1-7"
         sodipodi:linespacing="125%"><tspan
           sodipodi:role="line"
           id="tspan3757-1-9-8"
           x="152.53957"
           y="702.23291"
           style="font-size:20px">&amp;</tspan></text>
      <text
         xml:space="preserve"
         style="font-style:normal;font-weight:normal;font-size:10px;line-height:125%;font-family:Sans;letter-spacing:0px;word-spacing:0px;fill:#000000;fill-opacity:1;stroke:none"
         x="197.11249"
         y="676.065"
         id="text3759-7-5"
         sodipodi:linespacing="125%"><tspan
           sodipodi:role="line"
           id="tspan3761-5-0"
           x="197.11249"
           y="676.065"
           style="font-size:20px">≥1</tspan></text>
      <rect
         style="fill:none;stroke:#000000;stroke-width:1;stroke-miterlimit:4;stroke-dasharray:none;stroke-dashoffset:0;stroke-opacity:1"
         id="rect2985-5-3-3"
         width="65.823784"
         height="97.051552"
         x="185.84499"
         y="622.54846"
         rx="2.838804"
         ry="4.9601626" />
      <circle
         style="color:#000000;clip-rule:nonzero;display:inline;overflow:visible;visibility:visible;opacity:1;isolation:auto;mix-blend-mode:normal;color-interpolation:sRGB;color-interpolation-filters:linearRGB;solid-color:#000000;solid-opacity:1;fill:#fdffff;fill-opacity:0.49803922;fill-rule:nonzero;stroke:#000000;stroke-width:1;stroke-linecap:butt;stroke-linejoin:miter;stroke-miterlimit:4;stroke-dasharray:none;stroke-dashoffset:0;stroke-opacity:1;color-rendering:auto;image-rendering:auto;shape-rendering:auto;text-rendering:auto;enable-background:accumulate"
         id="path8178-0-0-9-3-6"
         cx="257.24017"
         cy="670.4668"
         r="4.8639975" />
      <text
         xml:space="preserve"
         style="font-style:normal;font-variant:normal;font-weight:normal;font-stretch:normal;font-size:12px;line-height:125%;font-family:Serif;-inkscape-font-specification:Serif;letter-spacing:0px;word-spacing:0px;fill:#000000;fill-opacity:1;stroke:none"
         x="136.89702"
         y="640.29291"
         id="text3861-3-3"
         sodipodi:linespacing="125%"><tspan
           sodipodi:role="line"
           id="tspan3863-60-2"
           x="136.89702"
           y="640.29291"
           style="font-style:italic;font-size:14px">A</tspan></text>
      <text
         xml:space="preserve"
         style="font-style:normal;font-variant:normal;font-weight:normal;font-stretch:normal;font-size:12px;line-height:125%;font-family:Serif;-inkscape-font-specification:Serif;letter-spacing:0px;word-spacing:0px;fill:#000000;fill-opacity:1;stroke:none"
         x="136.12862"
         y="660.33618"
         id="text3861-0-62-0"
         sodipodi:linespacing="125%"><tspan
           sodipodi:role="line"
           id="tspan3863-6-61-6"
           x="136.12862"
           y="660.33618"
           style="font-style:italic;font-size:14px">B</tspan></text>
      <text
         xml:space="preserve"
         style="font-style:normal;font-variant:normal;font-weight:normal;font-stretch:normal;font-size:12px;line-height:125%;font-family:Serif;-inkscape-font-specification:Serif;letter-spacing:0px;word-spacing:0px;fill:#000000;fill-opacity:1;stroke:none"
         x="137.69215"
         y="690.14288"
         id="text3861-3-5-5"
         sodipodi:linespacing="125%"><tspan
           sodipodi:role="line"
           id="tspan3863-60-9-4"
           x="137.69215"
           y="690.14288"
           style="font-style:italic;font-size:14px">C</tspan></text>
      <text
         xml:space="preserve"
         style="font-style:normal;font-variant:normal;font-weight:normal;font-stretch:normal;font-size:12px;line-height:125%;font-family:Serif;-inkscape-font-specification:Serif;letter-spacing:0px;word-spacing:0px;fill:#000000;fill-opacity:1;stroke:none"
         x="136.92375"
         y="710.18616"
         id="text3861-0-62-2-7"
         sodipodi:linespacing="125%"><tspan
           sodipodi:role="line"
           id="tspan3863-6-61-2-6"
           x="136.92375"
           y="710.18616"
           style="font-style:italic;font-size:14px">D</tspan></text>
      <text
         xml:space="preserve"
         style="font-style:normal;font-variant:normal;font-weight:normal;font-stretch:normal;font-size:12px;line-height:125%;font-family:Serif;-inkscape-font-specification:Serif;letter-spacing:0px;word-spacing:0px;fill:#000000;fill-opacity:1;stroke:none"
         x="241.15565"
         y="674.93658"
         id="text3861-3-6-5"
         sodipodi:linespacing="125%"><tspan
           sodipodi:role="line"
           id="tspan3863-60-1-6"
           x="241.15565"
           y="674.93658"
           style="font-style:italic;font-size:14px">f</tspan></text>
      <rect
         style="fill:none;stroke:#000000;stroke-width:1;stroke-miterlimit:4;stroke-dasharray:none;stroke-dashoffset:0;stroke-opacity:1"
         id="rect2985-62-3-3"
         width="50.217731"
         height="48.597805"
         x="135.03766"
         y="770.53827"
         rx="2.1657565"
         ry="4.9675241" />
      <text
         xml:space="preserve"
         style="font-style:normal;font-weight:normal;font-size:10px;line-height:125%;font-family:Sans;letter-spacing:0px;word-spacing:0px;fill:#000000;fill-opacity:1;stroke:none"
         x="152.42697"
         y="801.69696"
         id="text3755-9-1-6"
         sodipodi:linespacing="125%"><tspan
           sodipodi:role="line"
           id="tspan3757-1-9-7"
           x="152.42697"
           y="801.69696"
           style="font-size:20px">&amp;</tspan></text>
      <rect
         style="fill:none;stroke:#000000;stroke-width:1;stroke-miterlimit:4;stroke-dasharray:none;stroke-dashoffset:0;stroke-opacity:1"
         id="rect2985-62-3-4-5"
         width="50.217731"
         height="48.597805"
         x="135.03766"
         y="819.13611"
         rx="2.1657565"
         ry="4.9675241" />
      <text
         xml:space="preserve"
         style="font-style:normal;font-weight:normal;font-size:10px;line-height:125%;font-family:Sans;letter-spacing:0px;word-spacing:0px;fill:#000000;fill-opacity:1;stroke:none"
         x="152.42697"
         y="850.29474"
         id="text3755-9-1-7-3"
         sodipodi:linespacing="125%"><tspan
           sodipodi:role="line"
           id="tspan3757-1-9-8-5"
           x="152.42697"
           y="850.29474"
           style="font-size:20px">&amp;</tspan></text>
      <text
         xml:space="preserve"
         style="font-style:normal;font-weight:normal;font-size:10px;line-height:125%;font-family:Sans;letter-spacing:0px;word-spacing:0px;fill:#000000;fill-opacity:1;stroke:none"
         x="196.99991"
         y="824.12683"
         id="text3759-7-5-6"
         sodipodi:linespacing="125%"><tspan
           sodipodi:role="line"
           id="tspan3761-5-0-2"
           x="196.99991"
           y="824.12683"
           style="font-size:20px">≥1</tspan></text>
      <rect
         style="fill:none;stroke:#000000;stroke-width:1;stroke-miterlimit:4;stroke-dasharray:none;stroke-dashoffset:0;stroke-opacity:1"
         id="rect2985-5-3-3-9"
         width="65.823784"
         height="97.051552"
         x="185.73239"
         y="770.61029"
         rx="2.838804"
         ry="4.9601626" />
      <circle
         style="color:#000000;clip-rule:nonzero;display:inline;overflow:visible;visibility:visible;opacity:1;isolation:auto;mix-blend-mode:normal;color-interpolation:sRGB;color-interpolation-filters:linearRGB;solid-color:#000000;solid-opacity:1;fill:#fdffff;fill-opacity:0.49803922;fill-rule:nonzero;stroke:#000000;stroke-width:1;stroke-linecap:butt;stroke-linejoin:miter;stroke-miterlimit:4;stroke-dasharray:none;stroke-dashoffset:0;stroke-opacity:1;color-rendering:auto;image-rendering:auto;shape-rendering:auto;text-rendering:auto;enable-background:accumulate"
         id="path8178-0-0-9-3-6-1"
         cx="257.12759"
         cy="818.52863"
         r="4.8639975" />
      <text
         xml:space="preserve"
         style="font-style:normal;font-variant:normal;font-weight:normal;font-stretch:normal;font-size:12px;line-height:125%;font-family:Serif;-inkscape-font-specification:Serif;letter-spacing:0px;word-spacing:0px;fill:#000000;fill-opacity:1;stroke:none"
         x="136.78442"
         y="788.35474"
         id="text3861-3-3-7"
         sodipodi:linespacing="125%"><tspan
           sodipodi:role="line"
           id="tspan3863-60-2-0"
           x="136.78442"
           y="788.35474"
           style="font-style:italic;font-size:14px">A</tspan></text>
      <text
         xml:space="preserve"
         style="font-style:normal;font-variant:normal;font-weight:normal;font-stretch:normal;font-size:12px;line-height:125%;font-family:Serif;-inkscape-font-specification:Serif;letter-spacing:0px;word-spacing:0px;fill:#000000;fill-opacity:1;stroke:none"
         x="136.01602"
         y="808.39801"
         id="text3861-0-62-0-9"
         sodipodi:linespacing="125%"><tspan
           sodipodi:role="line"
           id="tspan3863-6-61-6-3"
           x="136.01602"
           y="808.39801"
           style="font-style:italic;font-size:14px">B</tspan></text>
      <text
         xml:space="preserve"
         style="font-style:normal;font-variant:normal;font-weight:normal;font-stretch:normal;font-size:12px;line-height:125%;font-family:Serif;-inkscape-font-specification:Serif;letter-spacing:0px;word-spacing:0px;fill:#000000;fill-opacity:1;stroke:none"
         x="137.57956"
         y="838.20471"
         id="text3861-3-5-5-6"
         sodipodi:linespacing="125%"><tspan
           sodipodi:role="line"
           id="tspan3863-60-9-4-0"
           x="137.57956"
           y="838.20471"
           style="font-style:italic;font-size:14px">C</tspan></text>
      <text
         xml:space="preserve"
         style="font-style:normal;font-variant:normal;font-weight:normal;font-stretch:normal;font-size:12px;line-height:125%;font-family:Serif;-inkscape-font-specification:Serif;letter-spacing:0px;word-spacing:0px;fill:#000000;fill-opacity:1;stroke:none"
         x="136.81116"
         y="858.24799"
         id="text3861-0-62-2-7-6"
         sodipodi:linespacing="125%"><tspan
           sodipodi:role="line"
           id="tspan3863-6-61-2-6-2"
           x="136.81116"
           y="858.24799"
           style="font-style:italic;font-size:14px">D</tspan></text>
      <text
         xml:space="preserve"
         style="font-style:normal;font-variant:normal;font-weight:normal;font-stretch:normal;font-size:12px;line-height:125%;font-family:Serif;-inkscape-font-specification:Serif;letter-spacing:0px;word-spacing:0px;fill:#000000;fill-opacity:1;stroke:none"
         x="241.04306"
         y="822.99841"
         id="text3861-3-6-5-6"
         sodipodi:linespacing="125%"><tspan
           sodipodi:role="line"
           id="tspan3863-60-1-6-1"
           x="241.04306"
           y="822.99841"
           style="font-style:italic;font-size:14px">f</tspan></text>
      <rect
         style="fill:none;stroke:#000000;stroke-width:1;stroke-miterlimit:4;stroke-dasharray:none;stroke-dashoffset:0;stroke-opacity:1"
         id="rect2985-62-3-8"
         width="50.217731"
         height="48.597805"
         x="318.08939"
         y="696.05859"
         rx="2.1657565"
         ry="4.9675241" />
      <text
         xml:space="preserve"
         style="font-style:normal;font-weight:normal;font-size:10px;line-height:125%;font-family:Sans;letter-spacing:0px;word-spacing:0px;fill:#000000;fill-opacity:1;stroke:none"
         x="335.4787"
         y="727.21722"
         id="text3755-9-1-79"
         sodipodi:linespacing="125%"><tspan
           sodipodi:role="line"
           id="tspan3757-1-9-2"
           x="335.4787"
           y="727.21722"
           style="font-size:20px">&amp;</tspan></text>
      <rect
         style="fill:none;stroke:#000000;stroke-width:1;stroke-miterlimit:4;stroke-dasharray:none;stroke-dashoffset:0;stroke-opacity:1"
         id="rect2985-62-3-4-0"
         width="50.217731"
         height="48.597805"
         x="318.08939"
         y="744.65637"
         rx="2.1657565"
         ry="4.9675241" />
      <text
         xml:space="preserve"
         style="font-style:normal;font-weight:normal;font-size:10px;line-height:125%;font-family:Sans;letter-spacing:0px;word-spacing:0px;fill:#000000;fill-opacity:1;stroke:none"
         x="335.4787"
         y="775.815"
         id="text3755-9-1-7-2"
         sodipodi:linespacing="125%"><tspan
           sodipodi:role="line"
           id="tspan3757-1-9-8-3"
           x="335.4787"
           y="775.815"
           style="font-size:20px">&amp;</tspan></text>
      <text
         xml:space="preserve"
         style="font-style:normal;font-weight:normal;font-size:10px;line-height:125%;font-family:Sans;letter-spacing:0px;word-spacing:0px;fill:#000000;fill-opacity:1;stroke:none"
         x="380.05164"
         y="749.64709"
         id="text3759-7-5-7"
         sodipodi:linespacing="125%"><tspan
           sodipodi:role="line"
           id="tspan3761-5-0-5"
           x="380.05164"
           y="749.64709"
           style="font-size:20px">≥1</tspan></text>
      <rect
         style="fill:none;stroke:#000000;stroke-width:1;stroke-miterlimit:4;stroke-dasharray:none;stroke-dashoffset:0;stroke-opacity:1"
         id="rect2985-5-3-3-92"
         width="65.823784"
         height="97.051552"
         x="368.78412"
         y="696.13055"
         rx="2.838804"
         ry="4.9601626" />
      <circle
         style="color:#000000;clip-rule:nonzero;display:inline;overflow:visible;visibility:visible;opacity:1;isolation:auto;mix-blend-mode:normal;color-interpolation:sRGB;color-interpolation-filters:linearRGB;solid-color:#000000;solid-opacity:1;fill:#fdffff;fill-opacity:0.49803922;fill-rule:nonzero;stroke:#000000;stroke-width:1;stroke-linecap:butt;stroke-linejoin:miter;stroke-miterlimit:4;stroke-dasharray:none;stroke-dashoffset:0;stroke-opacity:1;color-rendering:auto;image-rendering:auto;shape-rendering:auto;text-rendering:auto;enable-background:accumulate"
         id="path8178-0-0-9-3-6-2"
         cx="440.17932"
         cy="744.04889"
         r="4.8639975" />
      <path
         style="fill:none;fill-rule:evenodd;stroke:#000000;stroke-width:1px;stroke-linecap:butt;stroke-linejoin:miter;stroke-opacity:1"
         d="m 445.26009,743.78797 26.03015,0"
         id="path8266-1-8"
         inkscape:connector-curvature="0"
         sodipodi:nodetypes="cc" />
      <text
         xml:space="preserve"
         style="font-style:normal;font-variant:normal;font-weight:normal;font-stretch:normal;font-size:12px;line-height:125%;font-family:Serif;-inkscape-font-specification:Serif;letter-spacing:0px;word-spacing:0px;fill:#000000;fill-opacity:1;stroke:none"
         x="319.83615"
         y="713.875"
         id="text3861-3-3-9"
         sodipodi:linespacing="125%"><tspan
           sodipodi:role="line"
           id="tspan3863-60-2-7"
           x="319.83615"
           y="713.875"
           style="font-style:italic;font-size:14px">A</tspan></text>
      <text
         xml:space="preserve"
         style="font-style:normal;font-variant:normal;font-weight:normal;font-stretch:normal;font-size:12px;line-height:125%;font-family:Serif;-inkscape-font-specification:Serif;letter-spacing:0px;word-spacing:0px;fill:#000000;fill-opacity:1;stroke:none"
         x="319.06775"
         y="733.91827"
         id="text3861-0-62-0-3"
         sodipodi:linespacing="125%"><tspan
           sodipodi:role="line"
           id="tspan3863-6-61-6-6"
           x="319.06775"
           y="733.91827"
           style="font-style:italic;font-size:14px">B</tspan></text>
      <text
         xml:space="preserve"
         style="font-style:normal;font-variant:normal;font-weight:normal;font-stretch:normal;font-size:12px;line-height:125%;font-family:Serif;-inkscape-font-specification:Serif;letter-spacing:0px;word-spacing:0px;fill:#000000;fill-opacity:1;stroke:none"
         x="320.63129"
         y="763.72498"
         id="text3861-3-5-5-1"
         sodipodi:linespacing="125%"><tspan
           sodipodi:role="line"
           id="tspan3863-60-9-4-2"
           x="320.63129"
           y="763.72498"
           style="font-style:italic;font-size:14px">C</tspan></text>
      <text
         xml:space="preserve"
         style="font-style:normal;font-variant:normal;font-weight:normal;font-stretch:normal;font-size:12px;line-height:125%;font-family:Serif;-inkscape-font-specification:Serif;letter-spacing:0px;word-spacing:0px;fill:#000000;fill-opacity:1;stroke:none"
         x="319.86288"
         y="783.76825"
         id="text3861-0-62-2-7-9"
         sodipodi:linespacing="125%"><tspan
           sodipodi:role="line"
           id="tspan3863-6-61-2-6-3"
           x="319.86288"
           y="783.76825"
           style="font-style:italic;font-size:14px">D</tspan></text>
      <text
         xml:space="preserve"
         style="font-style:normal;font-variant:normal;font-weight:normal;font-stretch:normal;font-size:12px;line-height:125%;font-family:Serif;-inkscape-font-specification:Serif;letter-spacing:0px;word-spacing:0px;fill:#000000;fill-opacity:1;stroke:none"
         x="424.09479"
         y="748.51868"
         id="text3861-3-6-5-1"
         sodipodi:linespacing="125%"><tspan
           sodipodi:role="line"
           id="tspan3863-60-1-6-9"
           x="424.09479"
           y="748.51868"
           style="font-style:italic;font-size:14px">f</tspan></text>
      <g
         id="g8376">
        <text
           xml:space="preserve"
           style="font-style:normal;font-weight:normal;font-size:10px;line-height:125%;font-family:Sans;letter-spacing:0px;word-spacing:0px;fill:#000000;fill-opacity:1;stroke:none"
           x="-23.673132"
           y="613.16187"
           id="text3759-5-9-7-2-5"
           sodipodi:linespacing="125%"><tspan
             sodipodi:role="line"
             id="tspan3761-6-3-9-2-0"
             x="-23.673132"
             y="613.16187"
             style="font-size:20px">1</tspan></text>
        <rect
           style="fill:none;stroke:#000000;stroke-width:1;stroke-miterlimit:4;stroke-dasharray:none;stroke-dashoffset:0;stroke-opacity:1"
           id="rect2985-5-2-6-2-8-3"
           width="50.217731"
           height="48.597805"
           x="-41.012642"
           y="581.5733"
           rx="2.1657565"
           ry="4.9675241" />
        <circle
           r="4.8639975"
           cy="605.46716"
           cx="14.052345"
           id="path8178-0-0-9-6"
           style="color:#000000;clip-rule:nonzero;display:inline;overflow:visible;visibility:visible;opacity:1;isolation:auto;mix-blend-mode:normal;color-interpolation:sRGB;color-interpolation-filters:linearRGB;solid-color:#000000;solid-opacity:1;fill:#fdffff;fill-opacity:0.49803922;fill-rule:nonzero;stroke:#000000;stroke-width:1;stroke-linecap:butt;stroke-linejoin:miter;stroke-miterlimit:4;stroke-dasharray:none;stroke-dashoffset:0;stroke-opacity:1;color-rendering:auto;image-rendering:auto;shape-rendering:auto;text-rendering:auto;enable-background:accumulate" />
      </g>
      <g
         id="g8382"
         transform="translate(0,1.8899841)">
        <text
           xml:space="preserve"
           style="font-style:normal;font-weight:normal;font-size:10px;line-height:125%;font-family:Sans;letter-spacing:0px;word-spacing:0px;fill:#000000;fill-opacity:1;stroke:none"
           x="-23.673134"
           y="695.77808"
           id="text3759-5-9-7-2-5-1"
           sodipodi:linespacing="125%"><tspan
             sodipodi:role="line"
             id="tspan3761-6-3-9-2-0-0"
             x="-23.673134"
             y="695.77808"
             style="font-size:20px">1</tspan></text>
        <rect
           style="fill:none;stroke:#000000;stroke-width:1;stroke-miterlimit:4;stroke-dasharray:none;stroke-dashoffset:0;stroke-opacity:1"
           id="rect2985-5-2-6-2-8-3-6"
           width="50.217731"
           height="48.597805"
           x="-41.012642"
           y="664.18951"
           rx="2.1657565"
           ry="4.9675241" />
        <circle
           r="4.8639975"
           cy="688.08337"
           cx="14.052346"
           id="path8178-0-0-9-6-3"
           style="color:#000000;clip-rule:nonzero;display:inline;overflow:visible;visibility:visible;opacity:1;isolation:auto;mix-blend-mode:normal;color-interpolation:sRGB;color-interpolation-filters:linearRGB;solid-color:#000000;solid-opacity:1;fill:#fdffff;fill-opacity:0.49803922;fill-rule:nonzero;stroke:#000000;stroke-width:1;stroke-linecap:butt;stroke-linejoin:miter;stroke-miterlimit:4;stroke-dasharray:none;stroke-dashoffset:0;stroke-opacity:1;color-rendering:auto;image-rendering:auto;shape-rendering:auto;text-rendering:auto;enable-background:accumulate" />
      </g>
      <g
         id="g8388"
         transform="translate(-0.80996323,3.7798462)">
        <text
           xml:space="preserve"
           style="font-style:normal;font-weight:normal;font-size:10px;line-height:125%;font-family:Sans;letter-spacing:0px;word-spacing:0px;fill:#000000;fill-opacity:1;stroke:none"
           x="-22.863171"
           y="778.39441"
           id="text3759-5-9-7-2-5-2"
           sodipodi:linespacing="125%"><tspan
             sodipodi:role="line"
             id="tspan3761-6-3-9-2-0-06"
             x="-22.863171"
             y="778.39441"
             style="font-size:20px">1</tspan></text>
        <rect
           style="fill:none;stroke:#000000;stroke-width:1;stroke-miterlimit:4;stroke-dasharray:none;stroke-dashoffset:0;stroke-opacity:1"
           id="rect2985-5-2-6-2-8-3-1"
           width="50.217731"
           height="48.597805"
           x="-40.202679"
           y="746.80585"
           rx="2.1657565"
           ry="4.9675241" />
        <circle
           r="4.8639975"
           cy="770.69971"
           cx="14.862309"
           id="path8178-0-0-9-6-5"
           style="color:#000000;clip-rule:nonzero;display:inline;overflow:visible;visibility:visible;opacity:1;isolation:auto;mix-blend-mode:normal;color-interpolation:sRGB;color-interpolation-filters:linearRGB;solid-color:#000000;solid-opacity:1;fill:#fdffff;fill-opacity:0.49803922;fill-rule:nonzero;stroke:#000000;stroke-width:1;stroke-linecap:butt;stroke-linejoin:miter;stroke-miterlimit:4;stroke-dasharray:none;stroke-dashoffset:0;stroke-opacity:1;color-rendering:auto;image-rendering:auto;shape-rendering:auto;text-rendering:auto;enable-background:accumulate" />
      </g>
      <g
         id="g8394"
         transform="translate(-2.4298935,0)">
        <text
           xml:space="preserve"
           style="font-style:normal;font-weight:normal;font-size:10px;line-height:125%;font-family:Sans;letter-spacing:0px;word-spacing:0px;fill:#000000;fill-opacity:1;stroke:none"
           x="-21.243242"
           y="866.68036"
           id="text3759-5-9-7-2-5-5"
           sodipodi:linespacing="125%"><tspan
             sodipodi:role="line"
             id="tspan3761-6-3-9-2-0-4"
             x="-21.243242"
             y="866.68036"
             style="font-size:20px">1</tspan></text>
        <rect
           style="fill:none;stroke:#000000;stroke-width:1;stroke-miterlimit:4;stroke-dasharray:none;stroke-dashoffset:0;stroke-opacity:1"
           id="rect2985-5-2-6-2-8-3-7"
           width="50.217731"
           height="48.597805"
           x="-38.582748"
           y="835.09186"
           rx="2.1657565"
           ry="4.9675241" />
        <circle
           r="4.8639975"
           cy="858.98566"
           cx="16.482237"
           id="path8178-0-0-9-6-6"
           style="color:#000000;clip-rule:nonzero;display:inline;overflow:visible;visibility:visible;opacity:1;isolation:auto;mix-blend-mode:normal;color-interpolation:sRGB;color-interpolation-filters:linearRGB;solid-color:#000000;solid-opacity:1;fill:#fdffff;fill-opacity:0.49803922;fill-rule:nonzero;stroke:#000000;stroke-width:1;stroke-linecap:butt;stroke-linejoin:miter;stroke-miterlimit:4;stroke-dasharray:none;stroke-dashoffset:0;stroke-opacity:1;color-rendering:auto;image-rendering:auto;shape-rendering:auto;text-rendering:auto;enable-background:accumulate" />
      </g>
      <path
         style="fill:none;fill-rule:evenodd;stroke:#000000;stroke-width:1px;stroke-linecap:butt;stroke-linejoin:miter;stroke-opacity:1"
         d="m -88.804644,554.84447 0,358.81383"
         id="path8400"
         inkscape:connector-curvature="0" />
      <path
         style="fill:none;fill-rule:evenodd;stroke:#000000;stroke-width:1px;stroke-linecap:butt;stroke-linejoin:miter;stroke-opacity:1"
         d="m -88.784892,565.61313 193.582972,0 0,68.15495 29.78199,0"
         id="path8402"
         inkscape:connector-curvature="0" />
      <path
         style="fill:none;fill-rule:evenodd;stroke:#000000;stroke-width:1px;stroke-linecap:butt;stroke-linejoin:miter;stroke-opacity:1;marker-start:url(#marker8760)"
         d="m -61.86655,565.61313 0,37.80022 20.04557,0"
         id="path8404"
         inkscape:connector-curvature="0" />
      <path
         style="fill:none;fill-rule:evenodd;stroke:#000000;stroke-width:1px;stroke-linecap:butt;stroke-linejoin:miter;stroke-opacity:1"
         d="m 18.9205,605.2647 73.70668,0 0,80.79386 42.52308,0"
         id="path8406"
         inkscape:connector-curvature="0" />
      <path
         style="fill:none;fill-rule:evenodd;stroke:#000000;stroke-width:1px;stroke-linecap:butt;stroke-linejoin:miter;stroke-opacity:1"
         d="m -89.209625,734.25138 166.852475,0 0,-78.76895 57.10243,0"
         id="path8412"
         inkscape:connector-curvature="0" />
      <path
         style="fill:none;fill-rule:evenodd;stroke:#000000;stroke-width:1px;stroke-linecap:butt;stroke-linejoin:miter;stroke-opacity:1;marker-start:url(#marker8710)"
         d="m -62.278339,734.04889 0,41.10565 20.654069,0"
         id="path8414"
         inkscape:connector-curvature="0" />
      <path
         style="fill:none;fill-rule:evenodd;stroke:#000000;stroke-width:1px;stroke-linecap:butt;stroke-linejoin:miter;stroke-opacity:1"
         d="m 19.32548,774.54707 73.09921,0 0,-69.45437 42.32059,0"
         id="path8416"
         inkscape:connector-curvature="0" />
      <path
         style="fill:none;fill-rule:evenodd;stroke:#000000;stroke-width:1px;stroke-linecap:butt;stroke-linejoin:miter;stroke-opacity:1"
         d="m -89.007135,648.59774 151.058195,0 0,135.26391 72.69422,0"
         id="path8418"
         inkscape:connector-curvature="0" />
      <path
         style="fill:none;fill-rule:evenodd;stroke:#000000;stroke-width:1px;stroke-linecap:butt;stroke-linejoin:miter;stroke-opacity:1;marker-start:url(#DotM)"
         d="m -61.86655,648.94544 0,40.66388 20.33194,0"
         id="path8420"
         inkscape:connector-curvature="0" />
      <path
         style="fill:none;fill-rule:evenodd;stroke:#000000;stroke-width:1px;stroke-linecap:butt;stroke-linejoin:miter;stroke-opacity:1"
         d="m 19.17484,690.18205 28.35017,0 0,142.60994 87.05506,0"
         id="path8422"
         inkscape:connector-curvature="0" />
      <path
         style="fill:none;fill-rule:evenodd;stroke:#000000;stroke-width:1px;stroke-linecap:butt;stroke-linejoin:miter;stroke-opacity:1"
         d="m -89.071257,815.3237 181.555627,0 0,-11.74098 42.66843,0"
         id="path8424"
         inkscape:connector-curvature="0" />
      <path
         style="fill:none;fill-rule:evenodd;stroke:#000000;stroke-width:1px;stroke-linecap:butt;stroke-linejoin:miter;stroke-opacity:1;marker-start:url(#marker8732)"
         d="m -62.43928,815.03734 0,43.81389 21.4774,0"
         id="path8426"
         inkscape:connector-curvature="0" />
      <path
         style="fill:none;fill-rule:evenodd;stroke:#000000;stroke-width:1px;stroke-linecap:butt;stroke-linejoin:miter;stroke-opacity:1"
         d="m 19.17484,858.85123 73.02316,0 0,-6.5864 42.66844,0"
         id="path8428"
         inkscape:connector-curvature="0" />
      <path
         style="fill:none;fill-rule:evenodd;stroke:#000000;stroke-width:1px;stroke-linecap:butt;stroke-linejoin:miter;stroke-opacity:1"
         d="m 262.11204,670.06178 26.12132,0 0,58.11488 29.76616,0"
         id="path8800"
         inkscape:connector-curvature="0" />
      <path
         style="fill:none;fill-rule:evenodd;stroke:#000000;stroke-width:1px;stroke-linecap:butt;stroke-linejoin:miter;stroke-opacity:1;marker-start:url(#marker8854)"
         d="m 288.03087,707.92757 29.76616,0"
         id="path8802"
         inkscape:connector-curvature="0" />
      <path
         style="fill:none;fill-rule:evenodd;stroke:#000000;stroke-width:1px;stroke-linecap:butt;stroke-linejoin:miter;stroke-opacity:1"
         d="m 262.11204,818.48759 26.12132,0 0,-61.15225 29.56367,0"
         id="path8804"
         inkscape:connector-curvature="0" />
      <path
         style="fill:none;fill-rule:evenodd;stroke:#000000;stroke-width:1px;stroke-linecap:butt;stroke-linejoin:miter;stroke-opacity:1;marker-start:url(#marker8814)"
         d="m 288.03087,779.02677 30.17114,0"
         id="path8806"
         inkscape:connector-curvature="0" />
      <text
         xml:space="preserve"
         style="font-style:normal;font-variant:normal;font-weight:normal;font-stretch:normal;font-size:12px;line-height:125%;font-family:Serif;-inkscape-font-specification:Serif;letter-spacing:0px;word-spacing:0px;fill:#000000;fill-opacity:1;stroke:none"
         x="-124.39441"
         y="568.85712"
         id="text3861-3-3-5"
         sodipodi:linespacing="125%"><tspan
           sodipodi:role="line"
           id="tspan3863-60-2-6"
           x="-124.39441"
           y="568.85712"
           style="font-style:italic;font-size:14px">A(0)</tspan></text>
      <text
         xml:space="preserve"
         style="font-style:normal;font-variant:normal;font-weight:normal;font-stretch:normal;font-size:12px;line-height:125%;font-family:Serif;-inkscape-font-specification:Serif;letter-spacing:0px;word-spacing:0px;fill:#000000;fill-opacity:1;stroke:none"
         x="-124.39441"
         y="650.80084"
         id="text3861-3-3-5-9"
         sodipodi:linespacing="125%"><tspan
           sodipodi:role="line"
           id="tspan3863-60-2-6-3"
           x="-124.39441"
           y="650.80084"
           style="font-style:italic;font-size:14px">A(1)</tspan></text>
      <text
         xml:space="preserve"
         style="font-style:normal;font-variant:normal;font-weight:normal;font-stretch:normal;font-size:12px;line-height:125%;font-family:Serif;-inkscape-font-specification:Serif;letter-spacing:0px;word-spacing:0px;fill:#000000;fill-opacity:1;stroke:none"
         x="-124.90369"
         y="738.8844"
         id="text3861-3-3-5-7"
         sodipodi:linespacing="125%"><tspan
           sodipodi:role="line"
           id="tspan3863-60-2-6-4"
           x="-124.90369"
           y="738.8844"
           style="font-style:italic;font-size:14px">B(0)</tspan></text>
      <text
         xml:space="preserve"
         style="font-style:normal;font-variant:normal;font-weight:normal;font-stretch:normal;font-size:12px;line-height:125%;font-family:Serif;-inkscape-font-specification:Serif;letter-spacing:0px;word-spacing:0px;fill:#000000;fill-opacity:1;stroke:none"
         x="-124.90369"
         y="820.08325"
         id="text3861-3-3-5-5"
         sodipodi:linespacing="125%"><tspan
           sodipodi:role="line"
           id="tspan3863-60-2-6-2"
           x="-124.90369"
           y="820.08325"
           style="font-style:italic;font-size:14px">B(1)</tspan></text>
      <text
         xml:space="preserve"
         style="font-style:normal;font-variant:normal;font-weight:normal;font-stretch:normal;font-size:12px;line-height:125%;font-family:Serif;-inkscape-font-specification:Serif;letter-spacing:0px;word-spacing:0px;fill:#000000;fill-opacity:1;stroke:none"
         x="474.97397"
         y="747.63074"
         id="text3861-3-6-5-1-5"
         sodipodi:linespacing="125%"><tspan
           sodipodi:role="line"
           id="tspan3863-60-1-6-9-4"
           x="474.97397"
           y="747.63074"
           style="font-style:italic;font-size:14px">f</tspan></text>
      <text
         xml:space="preserve"
         style="font-style:normal;font-variant:normal;font-weight:normal;font-stretch:normal;font-size:12px;line-height:125%;font-family:Serif;-inkscape-font-specification:Serif;letter-spacing:0px;word-spacing:0px;fill:#000000;fill-opacity:1;stroke:none"
         x="20.916773"
         y="622.53235"
         id="text3861-3-3-5-3"
         sodipodi:linespacing="125%"><tspan
           sodipodi:role="line"
           id="tspan3863-60-2-6-6"
           x="20.916773"
           y="622.53235"
           style="font-style:italic;font-size:14px">Ac(0)</tspan></text>
      <text
         xml:space="preserve"
         style="font-style:normal;font-variant:normal;font-weight:normal;font-stretch:normal;font-size:12px;line-height:125%;font-family:Serif;-inkscape-font-specification:Serif;letter-spacing:0px;word-spacing:0px;fill:#000000;fill-opacity:1;stroke:none"
         x="22.062235"
         y="684.38727"
         id="text3861-3-3-5-9-7"
         sodipodi:linespacing="125%"><tspan
           sodipodi:role="line"
           id="tspan3863-60-2-6-3-5"
           x="22.062235"
           y="684.38727"
           style="font-style:italic;font-size:14px">Ac(1)</tspan></text>
      <text
         xml:space="preserve"
         style="font-style:normal;font-variant:normal;font-weight:normal;font-stretch:normal;font-size:12px;line-height:125%;font-family:Serif;-inkscape-font-specification:Serif;letter-spacing:0px;word-spacing:0px;fill:#000000;fill-opacity:1;stroke:none"
         x="10.098343"
         y="792.06067"
         id="text3861-3-3-5-7-3"
         sodipodi:linespacing="125%"><tspan
           sodipodi:role="line"
           id="tspan3863-60-2-6-4-5"
           x="10.098343"
           y="792.06067"
           style="font-style:italic;font-size:14px">Bc(0)</tspan></text>
      <text
         xml:space="preserve"
         style="font-style:normal;font-variant:normal;font-weight:normal;font-stretch:normal;font-size:12px;line-height:125%;font-family:Serif;-inkscape-font-specification:Serif;letter-spacing:0px;word-spacing:0px;fill:#000000;fill-opacity:1;stroke:none"
         x="26.134802"
         y="853.91559"
         id="text3861-3-3-5-5-6"
         sodipodi:linespacing="125%"><tspan
           sodipodi:role="line"
           id="tspan3863-60-2-6-2-2"
           x="26.134802"
           y="853.91559"
           style="font-style:italic;font-size:14px">Bc(1)</tspan></text>
      <text
         xml:space="preserve"
         style="font-style:normal;font-variant:normal;font-weight:normal;font-stretch:normal;font-size:12px;line-height:125%;font-family:Serif;-inkscape-font-specification:Serif;letter-spacing:0px;word-spacing:0px;fill:#000000;fill-opacity:1;stroke:none"
         x="269.54535"
         y="658.61444"
         id="text3861-3-3-5-5-9"
         sodipodi:linespacing="125%"><tspan
           sodipodi:role="line"
           id="tspan3863-60-2-6-2-1"
           x="269.54535"
           y="658.61444"
           style="font-style:italic;font-size:14px">eq0c</tspan></text>
      <text
         xml:space="preserve"
         style="font-style:normal;font-variant:normal;font-weight:normal;font-stretch:normal;font-size:12px;line-height:125%;font-family:Serif;-inkscape-font-specification:Serif;letter-spacing:0px;word-spacing:0px;fill:#000000;fill-opacity:1;stroke:none"
         x="272.19196"
         y="835.67218"
         id="text3861-3-3-5-5-9-2"
         sodipodi:linespacing="125%"><tspan
           sodipodi:role="line"
           id="tspan3863-60-2-6-2-1-7"
           x="272.19196"
           y="835.67218"
           style="font-style:italic;font-size:14px">eq1c</tspan></text>
      <text
         xml:space="preserve"
         style="font-style:normal;font-variant:normal;font-weight:normal;font-stretch:normal;font-size:12px;line-height:125%;font-family:Serif;-inkscape-font-specification:Serif;letter-spacing:0px;word-spacing:0px;fill:#000000;fill-opacity:1;stroke:none"
         x="137.02754"
         y="617.46179"
         id="text3861-3-3-5-5-9-0"
         sodipodi:linespacing="125%"><tspan
           sodipodi:role="line"
           id="tspan3863-60-2-6-2-1-9"
           x="137.02754"
           y="617.46179"
           style="font-style:normal;font-variant:normal;font-weight:normal;font-stretch:normal;font-size:14px;font-family:sans-serif;-inkscape-font-specification:sans-serif">aoi22</tspan></text>
      <text
         xml:space="preserve"
         style="font-style:normal;font-variant:normal;font-weight:normal;font-stretch:normal;font-size:12px;line-height:125%;font-family:Serif;-inkscape-font-specification:Serif;letter-spacing:0px;word-spacing:0px;fill:#000000;fill-opacity:1;stroke:none"
         x="136.05434"
         y="766.7063"
         id="text3861-3-3-5-5-9-0-8"
         sodipodi:linespacing="125%"><tspan
           sodipodi:role="line"
           id="tspan3863-60-2-6-2-1-9-1"
           x="136.05434"
           y="766.7063"
           style="font-style:normal;font-variant:normal;font-weight:normal;font-stretch:normal;font-size:14px;font-family:sans-serif;-inkscape-font-specification:sans-serif">aoi22</tspan></text>
      <text
         xml:space="preserve"
         style="font-style:normal;font-variant:normal;font-weight:normal;font-stretch:normal;font-size:12px;line-height:125%;font-family:Serif;-inkscape-font-specification:Serif;letter-spacing:0px;word-spacing:0px;fill:#000000;fill-opacity:1;stroke:none"
         x="318.7554"
         y="691.10577"
         id="text3861-3-3-5-5-9-0-2"
         sodipodi:linespacing="125%"><tspan
           sodipodi:role="line"
           id="tspan3863-60-2-6-2-1-9-8"
           x="318.7554"
           y="691.10577"
           style="font-style:normal;font-variant:normal;font-weight:normal;font-stretch:normal;font-size:14px;font-family:sans-serif;-inkscape-font-specification:sans-serif">aoi22</tspan></text>
      <text
         xml:space="preserve"
         style="font-style:normal;font-variant:normal;font-weight:normal;font-stretch:normal;font-size:12px;line-height:125%;font-family:Serif;-inkscape-font-specification:Serif;letter-spacing:0px;word-spacing:0px;fill:#000000;fill-opacity:1;stroke:none"
         x="135.4816"
         y="734.63336"
         id="text3861-3-3-5-5-9-0-9"
         sodipodi:linespacing="125%"><tspan
           sodipodi:role="line"
           id="tspan3863-60-2-6-2-1-9-3"
           x="135.4816"
           y="734.63336"
           style="font-style:normal;font-variant:normal;font-weight:normal;font-stretch:normal;font-size:14px;font-family:sans-serif;-inkscape-font-specification:sans-serif">c1</tspan></text>
      <text
         xml:space="preserve"
         style="font-style:normal;font-variant:normal;font-weight:normal;font-stretch:normal;font-size:12px;line-height:125%;font-family:Serif;-inkscape-font-specification:Serif;letter-spacing:0px;word-spacing:0px;fill:#000000;fill-opacity:1;stroke:none"
         x="136.8399"
         y="882.1825"
         id="text3861-3-3-5-5-9-0-9-6"
         sodipodi:linespacing="125%"><tspan
           sodipodi:role="line"
           id="tspan3863-60-2-6-2-1-9-3-8"
           x="136.8399"
           y="882.1825"
           style="font-style:normal;font-variant:normal;font-weight:normal;font-stretch:normal;font-size:14px;font-family:sans-serif;-inkscape-font-specification:sans-serif">c2</tspan></text>
      <text
         xml:space="preserve"
         style="font-style:normal;font-variant:normal;font-weight:normal;font-stretch:normal;font-size:12px;line-height:125%;font-family:Serif;-inkscape-font-specification:Serif;letter-spacing:0px;word-spacing:0px;fill:#000000;fill-opacity:1;stroke:none"
         x="318.39554"
         y="807.15485"
         id="text3861-3-3-5-5-9-0-9-0"
         sodipodi:linespacing="125%"><tspan
           sodipodi:role="line"
           id="tspan3863-60-2-6-2-1-9-3-2"
           x="318.39554"
           y="807.15485"
           style="font-style:normal;font-variant:normal;font-weight:normal;font-stretch:normal;font-size:14px;font-family:sans-serif;-inkscape-font-specification:sans-serif">c3</tspan></text>
    </g>
    <circle
       style="color:#000000;clip-rule:nonzero;display:inline;overflow:visible;visibility:visible;opacity:1;isolation:auto;mix-blend-mode:normal;color-interpolation:sRGB;color-interpolation-filters:linearRGB;solid-color:#000000;solid-opacity:1;fill:#fdffff;fill-opacity:0.49803922;fill-rule:nonzero;stroke:#000000;stroke-width:1;stroke-linecap:butt;stroke-linejoin:miter;stroke-miterlimit:4;stroke-dasharray:none;stroke-dashoffset:0;stroke-opacity:1;color-rendering:auto;image-rendering:auto;shape-rendering:auto;text-rendering:auto;enable-background:accumulate"
       id="path8178-0-0-9"
       cx="409.53763"
       cy="352.34891"
       r="4.8639975" />
  </g>
</svg>
