<?xml version="1.0" encoding="UTF-8" standalone="no"?>
<!DOCTYPE svg PUBLIC "-//W3C//DTD SVG 1.1//EN" "http://www.w3.org/Graphics/SVG/1.1/DTD/svg11.dtd">
<!-- Generated by Microsoft Visio, SVG Export schemaTask.svg Page-1 -->
<svg xmlns="http://www.w3.org/2000/svg" xmlns:xlink="http://www.w3.org/1999/xlink" xmlns:ev="http://www.w3.org/2001/xml-events"
		xmlns:v="http://schemas.microsoft.com/visio/2003/SVGExtensions/" width="6.29921in" height="3.93701in"
		viewBox="0 0 453.543 283.465" xml:space="preserve" color-interpolation-filters="sRGB" class="st20">
	<v:documentProperties v:langID="1033" v:metric="true" v:viewMarkup="false">
		<v:userDefs>
			<v:ud v:nameU="msvSubprocessMaster" v:prompt="" v:val="VT4(Rectangle)"/>
			<v:ud v:nameU="msvNoAutoConnect" v:val="VT0(1):26"/>
		</v:userDefs>
	</v:documentProperties>

	<style type="text/css">
	<![CDATA[
		.st1 {fill:#deebf6}
		.st2 {stroke:#4f87bb;stroke-width:0.75}
		.st3 {fill:#4f87bb;font-family:Cambria Math;font-size:2.50001em}
		.st4 {visibility:visible}
		.st5 {fill:none;filter:url(#filter_2);stroke:#5b9bd5;stroke-opacity:0.22}
		.st6 {fill:none;stroke:#000000;stroke-width:1}
		.st7 {fill:#5b9bd5;fill-opacity:0.22;filter:url(#filter_2);stroke:#5b9bd5;stroke-linecap:round;stroke-linejoin:round;stroke-opacity:0.22}
		.st8 {fill:#886f98;stroke:#000000;stroke-linecap:round;stroke-linejoin:round;stroke-width:1}
		.st9 {fill:none;stroke:none;stroke-width:0.25}
		.st10 {fill:#000000;font-family:Cambria Math;font-size:1.5em}
		.st11 {marker-end:url(#mrkr5-36);stroke:#c00000;stroke-linecap:round;stroke-linejoin:round;stroke-width:1.5}
		.st12 {fill:#c00000;fill-opacity:1;stroke:#c00000;stroke-opacity:1;stroke-width:0.37313432835821}
		.st13 {stroke:#000000;stroke-linecap:round;stroke-linejoin:round;stroke-width:1.25}
		.st14 {stroke:#000000;stroke-linecap:round;stroke-linejoin:round;stroke-width:1}
		.st15 {stroke:#c00000;stroke-linecap:round;stroke-linejoin:round;stroke-width:1.5}
		.st16 {marker-end:url(#mrkr5-91);stroke:#70ad47;stroke-linecap:round;stroke-linejoin:round;stroke-width:1.5}
		.st17 {fill:#70ad47;fill-opacity:1;stroke:#70ad47;stroke-opacity:1;stroke-width:0.37313432835821}
		.st18 {fill:#5b9bd5;fill-opacity:0.22;filter:url(#filter_2);stroke:#5b9bd5;stroke-opacity:0.22}
		.st19 {fill:#000000;stroke:#000000;stroke-width:0.25}
		.st20 {fill:none;fill-rule:evenodd;font-size:12px;overflow:visible;stroke-linecap:square;stroke-miterlimit:3}
	]]>
	</style>

	<defs id="Markers">
		<g id="lend5">
			<path d="M 2 1 L 0 0 L 1.98117 -0.993387 C 1.67173 -0.364515 1.67301 0.372641 1.98465 1.00043 " style="stroke:none"/>
		</g>
		<marker id="mrkr5-36" class="st12" v:arrowType="5" v:arrowSize="2" v:setback="4.45" refX="-4.45" orient="auto"
				markerUnits="strokeWidth" overflow="visible">
			<use xlink:href="#lend5" transform="scale(-2.68,-2.68) "/>
		</marker>
		<marker id="mrkr5-91" class="st17" v:arrowType="5" v:arrowSize="2" v:setback="4.45" refX="-4.45" orient="auto"
				markerUnits="strokeWidth" overflow="visible">
			<use xlink:href="#lend5" transform="scale(-2.68,-2.68) "/>
		</marker>
	</defs>
	<defs id="Filters">
		<filter id="filter_2">
			<feGaussianBlur stdDeviation="2"/>
		</filter>
	</defs>
	<g v:mID="0" v:index="1" v:groupContext="foregroundPage">
		<v:userDefs>
			<v:ud v:nameU="msvThemeOrder" v:val="VT0(0):26"/>
		</v:userDefs>
		<title>Page-1</title>
		<v:pageProperties v:drawingScale="0.0393701" v:pageScale="0.0393701" v:drawingUnits="24" v:shadowOffsetX="8.50394"
				v:shadowOffsetY="-8.50394"/>
		<g id="shape81-1" v:mID="81" v:groupContext="shape" transform="translate(99.5856,-141.359)">
			<title>Cloud</title>
			<desc>?</desc>
			<v:userDefs>
				<v:ud v:nameU="visVersion" v:prompt="" v:val="VT0(15):26"/>
			</v:userDefs>
			<v:textBlock v:margins="rect(4,4,4,4)" v:tabSpace="42.5197"/>
			<v:textRect cx="56.6929" cy="240.945" width="113.39" height="85.0394"/>
			<path d="M5.58 248.66 A8.95424 11.2986 0 0 1 9.88 226.96 A18.1582 22.9124 0 0 1 36.23 208.64 A20.8506 26.3097 0 0 1 58.8
						 204.57 A13.0752 16.4985 0 0 1 78.16 203.2 A14.8864 18.7839 0 0 1 101.82 209.99 A10.6442 13.4306 0 0 1 110.42
						 228.99 A13.1842 16.6355 0 0 1 99.67 256.12 A16.6329 20.987 0 0 1 76.01 269.69 A19.6116 24.7455 0 0 1 43.76
						 275.12 A24.8602 31.3681 0 0 1 15.79 269.69 A9.80787 12.3758 0 0 1 5.58 248.66 Z" class="st1"/>
			<path d="M5.58 248.66 A8.95424 11.2986 0 0 1 9.88 226.96 A18.1582 22.9124 0 0 1 36.23 208.64 A20.8506 26.3097 0 0 1 58.8
						 204.57 A13.0752 16.4985 0 0 1 78.16 203.2 A14.8864 18.7839 0 0 1 101.82 209.99 A10.6442 13.4306 0 0 1 110.42
						 228.99 A13.1842 16.6355 0 0 1 99.67 256.12 A16.6329 20.987 0 0 1 76.01 269.69 A19.6116 24.7455 0 0 1 43.76
						 275.12 A24.8602 31.3681 0 0 1 15.79 269.69 A9.80787 12.3758 0 0 1 5.58 248.66" class="st2"/>
			<path d="M11.49 249.34 A8.9295 11.2674 0 0 1 5.58 248.66" class="st2"/>
			<path d="M42.13 271.73 A8.96837 11.3165 -180 0 0 43.76 275.12" class="st2"/>
			<path d="M76.82 265.62 A7.23966 9.13514 0 0 1 76.01 269.69" class="st2"/>
			<path d="M93.21 245.26 A7.59674 9.58572 0 0 1 99.67 256.12" class="st2"/>
			<path d="M107.19 233.06 A6.93548 8.75133 -180 0 0 110.42 228.99" class="st2"/>
			<path d="M39.45 211.35 A10.6952 13.4949 -180 0 0 36.23 208.64" class="st2"/>
			<text x="50.36" y="249.95" class="st3" v:langID="1050"><v:paragraph v:horizAlign="1"/><v:tabList/>?</text>		</g>
		<g id="shape82-11" v:mID="82" v:groupContext="shape" transform="translate(68.0315,-35.4331)">
			<title>Rectangle</title>
			<v:userDefs>
				<v:ud v:nameU="visVersion" v:val="VT0(15):26"/>
			</v:userDefs>
			<g id="shadow82-12" v:groupContext="shadow" v:shadowOffsetX="0.345598" v:shadowOffsetY="-1.97279" v:shadowType="1"
					transform="matrix(1,0,0,1,0.345598,1.97279)" class="st4">
				<rect x="0" y="70.8662" width="299.258" height="212.598" rx="5.66929" ry="5.66929" class="st5"/>
			</g>
			<rect x="0" y="70.8662" width="299.258" height="212.598" rx="5.66929" ry="5.66929" class="st6"/>
		</g>
		<g id="shape83-16" v:mID="83" v:groupContext="shape" transform="translate(248.032,-77.9528)">
			<title>Rectangle.3</title>
			<v:userDefs>
				<v:ud v:nameU="visVersion" v:val="VT0(15):26"/>
			</v:userDefs>
			<g id="shadow83-17" v:groupContext="shadow" v:shadowOffsetX="0.345598" v:shadowOffsetY="-1.97279" v:shadowType="1"
					transform="matrix(1,0,0,1,0.345598,1.97279)" class="st4">
				<rect x="0" y="175.478" width="85.0394" height="107.987" rx="8.50394" ry="8.50394" class="st7"/>
			</g>
			<rect x="0" y="175.478" width="85.0394" height="107.987" rx="8.50394" ry="8.50394" class="st8"/>
		</g>
		<g id="shape84-21" v:mID="84" v:groupContext="shape" transform="translate(248.032,-141.359)">
			<title>Sheet.84</title>
			<desc>T</desc>
			<v:textBlock v:margins="rect(4,4,4,4)" v:tabSpace="42.5197"/>
			<v:textRect cx="14.1732" cy="266.457" width="28.35" height="34.0157"/>
			<rect x="0" y="249.449" width="28.3465" height="34.0157" class="st9"/>
			<text x="8.84" y="271.86" class="st10" v:langID="2057"><v:paragraph v:horizAlign="1"/><v:tabList/>T</text>		</g>
		<g id="shape85-24" v:mID="85" v:groupContext="shape" transform="translate(21.2598,-160.157)">
			<title>Sheet.85</title>
			<desc>J</desc>
			<v:textBlock v:margins="rect(4,4,4,4)" v:tabSpace="42.5197"/>
			<v:textRect cx="8.50394" cy="266.457" width="17.01" height="34.0157"/>
			<rect x="0" y="249.449" width="17.0079" height="34.0157" class="st9"/>
			<text x="5.74" y="271.86" class="st10" v:langID="2057"><v:paragraph v:horizAlign="1"/><v:tabList/>J</text>		</g>
		<g id="shape86-27" v:mID="86" v:groupContext="shape" transform="translate(19.8425,-120.472)">
			<title>Sheet.86</title>
			<desc>K</desc>
			<v:textBlock v:margins="rect(4,4,4,4)" v:tabSpace="42.5197"/>
			<v:textRect cx="8.50394" cy="266.457" width="17.01" height="34.0157"/>
			<rect x="0" y="249.449" width="17.0079" height="34.0157" class="st9"/>
			<text x="4" y="271.86" class="st10" v:langID="2057"><v:paragraph v:horizAlign="1"/><v:tabList/>K</text>		</g>
		<g id="shape87-30" v:mID="87" v:groupContext="shape" transform="translate(-11.589,-161.875) rotate(-16.536)">
			<title>Sheet.87</title>
			<path d="M0 279.74 A31.5541 9.36834 -163.46 0 0 26.77 283.16 L27.08 282.99" class="st11"/>
		</g>
		<g id="shape88-37" v:mID="88" v:groupContext="shape" transform="translate(-76.4275,-90.2099) rotate(-31.4137)">
			<title>Sheet.88</title>
			<path d="M0 277.16 A36.7973 17.0503 -156.22 0 0 35.88 281.75 L36.16 281.52" class="st11"/>
		</g>
		<g id="shape89-42" v:mID="89" v:groupContext="shape" transform="translate(304.724,-141.732)">
			<title>Sheet.89</title>
			<desc>Q</desc>
			<v:textBlock v:margins="rect(4,4,4,4)" v:tabSpace="42.5197"/>
			<v:textRect cx="14.1732" cy="266.457" width="28.35" height="34.0157"/>
			<rect x="0" y="249.449" width="28.3465" height="34.0157" class="st9"/>
			<text x="8.29" y="271.86" class="st10" v:langID="2057"><v:paragraph v:horizAlign="1"/><v:tabList/>Q</text>		</g>
		<g id="group90-45" transform="translate(279.362,-93.5433)" v:mID="90" v:groupContext="group">
			<title>Sheet.90</title>
		</g>
		<g id="group91-46" transform="translate(304.724,-89.2914)" v:mID="91" v:groupContext="group">
			<title>Sheet.91</title>
			<g id="shape92-47" v:mID="92" v:groupContext="shape">
				<title>Sheet.92</title>
				<desc>Q</desc>
				<v:textBlock v:margins="rect(4,4,4,4)" v:tabSpace="42.5197"/>
				<v:textRect cx="14.1732" cy="266.457" width="28.35" height="34.0157"/>
				<rect x="0" y="249.449" width="28.3465" height="34.0157" class="st9"/>
				<text x="8.29" y="271.86" class="st10" v:langID="1050"><v:paragraph v:horizAlign="1"/><v:tabList/>Q</text>			</g>
			<g id="shape93-50" v:mID="93" v:groupContext="shape" transform="translate(9.48859,-26.9291)">
				<title>Sheet.93</title>
				<path d="M0 283.46 L9.92 283.46" class="st13"/>
			</g>
		</g>
		<g id="shape94-53" v:mID="94" v:groupContext="shape" transform="translate(333.071,-157.323)">
			<title>Sheet.94</title>
			<path d="M0 283.46 L35.43 283.46" class="st14"/>
		</g>
		<g id="shape95-56" v:mID="95" v:groupContext="shape" transform="translate(396.85,-140.315)">
			<title>Sheet.95</title>
			<desc>Q</desc>
			<v:textBlock v:margins="rect(4,4,4,4)" v:tabSpace="42.5197"/>
			<v:textRect cx="14.1732" cy="266.457" width="28.35" height="34.0157"/>
			<rect x="0" y="249.449" width="28.3465" height="34.0157" class="st9"/>
			<text x="8.29" y="271.86" class="st10" v:langID="2057"><v:paragraph v:horizAlign="1"/><v:tabList/>Q</text>		</g>
		<g id="group96-59" transform="translate(396.85,-89.2914)" v:mID="96" v:groupContext="group">
			<title>Sheet.96</title>
			<g id="shape97-60" v:mID="97" v:groupContext="shape">
				<title>Sheet.97</title>
				<desc>Q</desc>
				<v:textBlock v:margins="rect(4,4,4,4)" v:tabSpace="42.5197"/>
				<v:textRect cx="14.1732" cy="266.457" width="28.35" height="34.0157"/>
				<rect x="0" y="249.449" width="28.3465" height="34.0157" class="st9"/>
				<text x="8.29" y="271.86" class="st10" v:langID="1050"><v:paragraph v:horizAlign="1"/><v:tabList/>Q</text>			</g>
			<g id="shape98-63" v:mID="98" v:groupContext="shape" transform="translate(9.48859,-26.9291)">
				<title>Sheet.98</title>
				<path d="M0 283.46 L9.92 283.46" class="st13"/>
			</g>
		</g>
		<g id="shape99-66" v:mID="99" v:groupContext="shape" transform="translate(333.071,-106.299) rotate(2.28108E-05)">
			<title>Sheet.99</title>
			<path d="M0 283.46 L34.22 283.46" class="st14"/>
		</g>
		<g id="shape100-69" v:mID="100" v:groupContext="shape" transform="translate(75.1181,177.165) rotate(-90)">
			<title>Sheet.100</title>
			<path d="M0 283.46 L102.05 283.46" class="st15"/>
		</g>
		<g id="shape101-72" v:mID="101" v:groupContext="shape" transform="translate(331.304,338.112) rotate(-174.078)">
			<title>Sheet.101</title>
			<path d="M0 264.41 C-0.38 271.14 3.88 272.27 8.2 273.57 C19 276.81 30.15 281.06 36.97 277.58 C41.91 275.05 44.58 268.45
						 49.96 264.97 C57.59 260.03 70.66 261.37 79.38 268.14 C85.38 272.8 89.31 280.04 94.54 282.49 C102.21 286.07
						 112.67 279.33 120.31 272.85 C127.55 266.71 132.25 260.8 139.68 261.73 C145.77 262.5 153.7 267.85 161.12
						 267.07 L161.45 266.93" class="st11"/>
		</g>
		<g id="shape102-77" v:mID="102" v:groupContext="shape" transform="translate(630.709,126.142) rotate(90)">
			<title>Sheet.102</title>
			<path d="M0 283.46 L96.38 283.46" class="st15"/>
		</g>
		<g id="shape103-80" v:mID="103" v:groupContext="shape" transform="translate(243.433,486.291) rotate(-158.517)">
			<title>Sheet.103</title>
			<path d="M0 283.46 C2.45 283.01 4.52 282 6.61 281.02 C27.78 271.02 50.81 263.44 69.53 252.4 C83.03 244.44 94.28 234.68
						 110.35 228.24 C127.35 221.42 149.74 218.32 158.82 225.97 C164.64 230.87 164.99 240.2 169.78 246.65 C174.83
						 253.42 184.78 257 195.74 252.66 C202.26 250.07 209.14 244.67 215.39 245.07 C221.34 245.45 226.73 251.09
						 227.93 255.73 C230.51 265.66 213.92 271.01 228.38 280.17 L228.7 280.34" class="st11"/>
		</g>
		<g id="shape104-85" v:mID="104" v:groupContext="shape" transform="translate(211.975,-154.377) rotate(3.05482)">
			<title>Sheet.104</title>
			<path d="M0 275.37 C7.81 272.24 10.62 274.93 14.22 278.15 C17.38 280.98 21.14 284.23 24.07 283.31 C26.67 282.49 28.62
						 278.4 31.66 276.83 C35.09 275.05 39.91 276.48 43.97 277.05 L44.32 276.96" class="st16"/>
		</g>
		<g id="shape105-92" v:mID="105" v:groupContext="shape" transform="translate(367.087,-157.323)">
			<title>Sheet.105</title>
			<path d="M0 283.46 L32.31 283.46" class="st14"/>
		</g>
		<g id="shape106-95" v:mID="106" v:groupContext="shape" transform="translate(367.289,-106.299)">
			<title>Sheet.106</title>
			<path d="M0 283.46 L32.31 283.46" class="st14"/>
		</g>
		<g id="shape107-98" v:mID="107" v:groupContext="shape" transform="translate(36.0016,-177.166) rotate(0.000329443)">
			<title>Sheet.107</title>
			<path d="M0 283.46 L32.23 283.46" class="st14"/>
		</g>
		<g id="shape108-101" v:mID="108" v:groupContext="shape" transform="translate(35.7165,-137.197)">
			<title>Sheet.108</title>
			<path d="M0 283.46 L32.31 283.46" class="st14"/>
		</g>
		<g id="shape109-104" v:mID="109" v:groupContext="shape" transform="translate(345.26,-155.339)">
			<title>Sheet.109</title>
			<g id="shadow109-105" v:groupContext="shadow" v:shadowOffsetX="0.345598" v:shadowOffsetY="-1.97279" v:shadowType="1"
					transform="matrix(1,0,0,1,0.345598,1.97279)" class="st4">
				<ellipse cx="1.98426" cy="281.48" rx="1.98426" ry="1.98426" class="st18"/>
			</g>
			<ellipse cx="1.98426" cy="281.48" rx="1.98426" ry="1.98426" class="st19"/>
		</g>
		<g id="shape110-109" v:mID="110" v:groupContext="shape" transform="translate(356.598,-104.315)">
			<title>Sheet.110</title>
			<g id="shadow110-110" v:groupContext="shadow" v:shadowOffsetX="0.345598" v:shadowOffsetY="-1.97279" v:shadowType="1"
					transform="matrix(1,0,0,1,0.345598,1.97279)" class="st4">
				<ellipse cx="1.98426" cy="281.48" rx="1.98426" ry="1.98426" class="st18"/>
			</g>
			<ellipse cx="1.98426" cy="281.48" rx="1.98426" ry="1.98426" class="st19"/>
		</g>
		<g id="shape111-114" v:mID="111" v:groupContext="shape" transform="translate(66.0472,-175.181)">
			<title>Sheet.111</title>
			<g id="shadow111-115" v:groupContext="shadow" v:shadowOffsetX="0.345598" v:shadowOffsetY="-1.97279" v:shadowType="1"
					transform="matrix(1,0,0,1,0.345598,1.97279)" class="st4">
				<ellipse cx="1.98426" cy="281.48" rx="1.98426" ry="1.98426" class="st18"/>
			</g>
			<ellipse cx="1.98426" cy="281.48" rx="1.98426" ry="1.98426" class="st19"/>
		</g>
		<g id="shape112-119" v:mID="112" v:groupContext="shape" transform="translate(66.0472,-134.929)">
			<title>Sheet.112</title>
			<g id="shadow112-120" v:groupContext="shadow" v:shadowOffsetX="0.345598" v:shadowOffsetY="-1.97279" v:shadowType="1"
					transform="matrix(1,0,0,1,0.345598,1.97279)" class="st4">
				<ellipse cx="1.98426" cy="281.48" rx="1.98426" ry="1.98426" class="st18"/>
			</g>
			<ellipse cx="1.98426" cy="281.48" rx="1.98426" ry="1.98426" class="st19"/>
		</g>
	</g>
</svg>
