<?xml version="1.0" encoding="UTF-8" standalone="no"?>
<svg
   xmlns:dc="http://purl.org/dc/elements/1.1/"
   xmlns:cc="http://creativecommons.org/ns#"
   xmlns:rdf="http://www.w3.org/1999/02/22-rdf-syntax-ns#"
   xmlns:svg="http://www.w3.org/2000/svg"
   xmlns="http://www.w3.org/2000/svg"
   version="1.1"
   id="svg2"
   viewBox="0 0 426.16548 289.85378"
   height="81.803177mm"
   width="120.27337mm">
  <defs
     id="defs4">
    <marker
       style="overflow:visible"
       id="Arrow1Mstart"
       refX="0"
       refY="0"
       orient="auto">
      <path
         transform="matrix(0.4,0,0,0.4,4,0)"
         style="fill:#000000;fill-opacity:1;fill-rule:evenodd;stroke:#000000;stroke-width:1pt;stroke-opacity:1"
         d="M 0,0 5,-5 -12.5,0 5,5 0,0 Z"
         id="path8084" />
    </marker>
    <marker
       style="overflow:visible"
       id="Arrow1Mend"
       refX="0"
       refY="0"
       orient="auto">
      <path
         transform="matrix(-0.4,0,0,-0.4,-4,0)"
         style="fill:#000000;fill-opacity:1;fill-rule:evenodd;stroke:#000000;stroke-width:1pt;stroke-opacity:1"
         d="M 0,0 5,-5 -12.5,0 5,5 0,0 Z"
         id="path8087" />
    </marker>
  </defs>
  <metadata
     id="metadata7">
    <rdf:RDF>
      <cc:Work
         rdf:about="">
        <dc:format>image/svg+xml</dc:format>
        <dc:type
           rdf:resource="http://purl.org/dc/dcmitype/StillImage" />
        <dc:title></dc:title>
      </cc:Work>
    </rdf:RDF>
  </metadata>
  <g
     transform="translate(-50.002118,-156.90888)"
     id="layer1">
    <path
       id="path8070"
       d="m 90,162.3622 0,280"
       style="fill:none;fill-rule:evenodd;stroke:#000000;stroke-width:1px;stroke-linecap:butt;stroke-linejoin:miter;stroke-opacity:1;marker-start:url(#Arrow1Mstart)" />
    <path
       id="path8072"
       d="m 90,312.3622 380.71429,0"
       style="fill:none;fill-rule:evenodd;stroke:#000000;stroke-width:1px;stroke-linecap:butt;stroke-linejoin:miter;stroke-opacity:1;marker-end:url(#Arrow1Mend)" />
    <text
       id="text8380"
       y="172.46373"
       x="52.673843"
       style="font-style:normal;font-weight:normal;font-size:15px;line-height:125%;font-family:sans-serif;letter-spacing:0px;word-spacing:0px;fill:#000000;fill-opacity:1;stroke:none;stroke-width:1px;stroke-linecap:butt;stroke-linejoin:miter;stroke-opacity:1"
       xml:space="preserve"><tspan
         style="font-style:italic;font-variant:normal;font-weight:normal;font-stretch:normal;font-family:sans-serif;-inkscape-font-specification:'sans-serif Italic'"
         y="172.46373"
         x="52.673843"
         id="tspan8382">U<tspan
   id="tspan8384"
   style="font-style:normal;font-variant:normal;font-weight:normal;font-stretch:normal;font-family:sans-serif;-inkscape-font-specification:sans-serif">[V]</tspan></tspan></text>
    <rect
       y="182.3622"
       x="105"
       height="40.000008"
       width="105"
       id="rect8386"
       style="fill:#ff8080;fill-opacity:1;stroke:#000000;stroke-width:1;stroke-miterlimit:4;stroke-dasharray:none;stroke-dashoffset:0;stroke-opacity:1" />
    <rect
       y="222.3622"
       x="105"
       height="40.000008"
       width="105"
       id="rect8386-8"
       style="fill:#c0c0c0;fill-opacity:1;stroke:#000000;stroke-width:1;stroke-miterlimit:4;stroke-dasharray:none;stroke-dashoffset:0;stroke-opacity:1" />
    <rect
       y="262.36221"
       x="105"
       height="39.999992"
       width="105"
       id="rect8386-8-3"
       style="fill:#8484ff;fill-opacity:1;stroke:#000000;stroke-width:1;stroke-miterlimit:4;stroke-dasharray:none;stroke-dashoffset:0;stroke-opacity:1" />
    <text
       id="text8418"
       y="199.52498"
       x="157.96967"
       style="font-style:normal;font-weight:normal;font-size:15px;line-height:125%;font-family:sans-serif;letter-spacing:0px;word-spacing:0px;fill:#000000;fill-opacity:1;stroke:none;stroke-width:1px;stroke-linecap:butt;stroke-linejoin:miter;stroke-opacity:1"
       xml:space="preserve"><tspan
         style="font-size:11.25px;text-align:center;text-anchor:middle"
         id="tspan8422"
         y="199.52498"
         x="157.96967">Visoka naponska</tspan><tspan
         style="font-size:11.25px;text-align:center;text-anchor:middle"
         id="tspan8424"
         y="213.58748"
         x="157.96967">razina</tspan></text>
    <text
       id="text8418-3"
       y="238.43459"
       x="157.55219"
       style="font-style:normal;font-weight:normal;font-size:15px;line-height:125%;font-family:sans-serif;letter-spacing:0px;word-spacing:0px;fill:#000000;fill-opacity:1;stroke:none;stroke-width:1px;stroke-linecap:butt;stroke-linejoin:miter;stroke-opacity:1"
       xml:space="preserve"><tspan
         style="font-size:11.25px;text-align:center;text-anchor:middle"
         id="tspan8424-3"
         y="238.43459"
         x="157.55219">Zabranjeno</tspan><tspan
         id="tspan8467"
         style="font-size:11.25px;text-align:center;text-anchor:middle"
         y="252.49709"
         x="157.55219">područje</tspan></text>
    <text
       id="text8418-8"
       y="279.52499"
       x="157.46155"
       style="font-style:normal;font-weight:normal;font-size:15px;line-height:125%;font-family:sans-serif;letter-spacing:0px;word-spacing:0px;fill:#000000;fill-opacity:1;stroke:none;stroke-width:1px;stroke-linecap:butt;stroke-linejoin:miter;stroke-opacity:1"
       xml:space="preserve"><tspan
         style="font-size:11.25px;text-align:center;text-anchor:middle"
         id="tspan8422-0"
         y="279.52499"
         x="157.46155">Niska naponska</tspan><tspan
         style="font-size:11.25px;text-align:center;text-anchor:middle"
         id="tspan8424-4"
         y="293.58749"
         x="157.46155">razina</tspan></text>
    <rect
       y="252.00505"
       x="225.35715"
       height="40.000008"
       width="105"
       id="rect8386-7"
       style="fill:#ff8080;fill-opacity:1;stroke:#000000;stroke-width:1;stroke-miterlimit:4;stroke-dasharray:none;stroke-dashoffset:0;stroke-opacity:1" />
    <rect
       y="292.00504"
       x="225.35715"
       height="40.000008"
       width="105"
       id="rect8386-8-6"
       style="fill:#c0c0c0;fill-opacity:1;stroke:#000000;stroke-width:1;stroke-miterlimit:4;stroke-dasharray:none;stroke-dashoffset:0;stroke-opacity:1" />
    <rect
       y="332.00507"
       x="225.35715"
       height="39.999992"
       width="105"
       id="rect8386-8-3-8"
       style="fill:#8484ff;fill-opacity:1;stroke:#000000;stroke-width:1;stroke-miterlimit:4;stroke-dasharray:none;stroke-dashoffset:0;stroke-opacity:1" />
    <text
       id="text8418-9"
       y="269.16785"
       x="278.32681"
       style="font-style:normal;font-weight:normal;font-size:15px;line-height:125%;font-family:sans-serif;letter-spacing:0px;word-spacing:0px;fill:#000000;fill-opacity:1;stroke:none;stroke-width:1px;stroke-linecap:butt;stroke-linejoin:miter;stroke-opacity:1"
       xml:space="preserve"><tspan
         style="font-size:11.25px;text-align:center;text-anchor:middle"
         id="tspan8422-06"
         y="269.16785"
         x="278.32681">Visoka naponska</tspan><tspan
         style="font-size:11.25px;text-align:center;text-anchor:middle"
         id="tspan8424-8"
         y="283.23035"
         x="278.32681">razina</tspan></text>
    <text
       id="text8418-3-7"
       y="308.07742"
       x="277.90933"
       style="font-style:normal;font-weight:normal;font-size:15px;line-height:125%;font-family:sans-serif;letter-spacing:0px;word-spacing:0px;fill:#000000;fill-opacity:1;stroke:none;stroke-width:1px;stroke-linecap:butt;stroke-linejoin:miter;stroke-opacity:1"
       xml:space="preserve"><tspan
         style="font-size:11.25px;text-align:center;text-anchor:middle"
         id="tspan8424-3-9"
         y="308.07742"
         x="277.90933">Zabranjeno</tspan><tspan
         id="tspan8467-0"
         style="font-size:11.25px;text-align:center;text-anchor:middle"
         y="322.13992"
         x="277.90933">područje</tspan></text>
    <text
       id="text8418-8-3"
       y="349.16785"
       x="277.8187"
       style="font-style:normal;font-weight:normal;font-size:15px;line-height:125%;font-family:sans-serif;letter-spacing:0px;word-spacing:0px;fill:#000000;fill-opacity:1;stroke:none;stroke-width:1px;stroke-linecap:butt;stroke-linejoin:miter;stroke-opacity:1"
       xml:space="preserve"><tspan
         style="font-size:11.25px;text-align:center;text-anchor:middle"
         id="tspan8422-0-3"
         y="349.16785"
         x="277.8187">Niska naponska</tspan><tspan
         style="font-size:11.25px;text-align:center;text-anchor:middle"
         id="tspan8424-4-3"
         y="363.23035"
         x="277.8187">razina</tspan></text>
    <rect
       y="322.71933"
       x="345"
       height="40.000008"
       width="105"
       id="rect8386-73"
       style="fill:#ff8080;fill-opacity:1;stroke:#000000;stroke-width:1;stroke-miterlimit:4;stroke-dasharray:none;stroke-dashoffset:0;stroke-opacity:1" />
    <rect
       y="362.71933"
       x="345"
       height="40.000008"
       width="105"
       id="rect8386-8-2"
       style="fill:#c0c0c0;fill-opacity:1;stroke:#000000;stroke-width:1;stroke-miterlimit:4;stroke-dasharray:none;stroke-dashoffset:0;stroke-opacity:1" />
    <rect
       y="402.71936"
       x="345"
       height="39.999992"
       width="105"
       id="rect8386-8-3-6"
       style="fill:#8484ff;fill-opacity:1;stroke:#000000;stroke-width:1;stroke-miterlimit:4;stroke-dasharray:none;stroke-dashoffset:0;stroke-opacity:1" />
    <text
       id="text8418-5"
       y="339.88211"
       x="397.96967"
       style="font-style:normal;font-weight:normal;font-size:15px;line-height:125%;font-family:sans-serif;letter-spacing:0px;word-spacing:0px;fill:#000000;fill-opacity:1;stroke:none;stroke-width:1px;stroke-linecap:butt;stroke-linejoin:miter;stroke-opacity:1"
       xml:space="preserve"><tspan
         style="font-size:11.25px;text-align:center;text-anchor:middle"
         id="tspan8422-2"
         y="339.88211"
         x="397.96967">Visoka naponska</tspan><tspan
         style="font-size:11.25px;text-align:center;text-anchor:middle"
         id="tspan8424-6"
         y="353.94461"
         x="397.96967">razina</tspan></text>
    <text
       id="text8418-3-5"
       y="378.79172"
       x="397.55219"
       style="font-style:normal;font-weight:normal;font-size:15px;line-height:125%;font-family:sans-serif;letter-spacing:0px;word-spacing:0px;fill:#000000;fill-opacity:1;stroke:none;stroke-width:1px;stroke-linecap:butt;stroke-linejoin:miter;stroke-opacity:1"
       xml:space="preserve"><tspan
         style="font-size:11.25px;text-align:center;text-anchor:middle"
         id="tspan8424-3-8"
         y="378.79172"
         x="397.55219">Zabranjeno</tspan><tspan
         id="tspan8467-7"
         style="font-size:11.25px;text-align:center;text-anchor:middle"
         y="392.85422"
         x="397.55219">područje</tspan></text>
    <text
       id="text8418-8-9"
       y="419.88214"
       x="397.46155"
       style="font-style:normal;font-weight:normal;font-size:15px;line-height:125%;font-family:sans-serif;letter-spacing:0px;word-spacing:0px;fill:#000000;fill-opacity:1;stroke:none;stroke-width:1px;stroke-linecap:butt;stroke-linejoin:miter;stroke-opacity:1"
       xml:space="preserve"><tspan
         style="font-size:11.25px;text-align:center;text-anchor:middle"
         id="tspan8422-0-6"
         y="419.88214"
         x="397.46155">Niska naponska</tspan><tspan
         style="font-size:11.25px;text-align:center;text-anchor:middle"
         id="tspan8424-4-0"
         y="433.94464"
         x="397.46155">razina</tspan></text>
  </g>
</svg>
