<?xml version="1.0" encoding="UTF-8" standalone="no"?>
<!-- Created with Inkscape (http://www.inkscape.org/) -->

<svg
   xmlns:dc="http://purl.org/dc/elements/1.1/"
   xmlns:cc="http://creativecommons.org/ns#"
   xmlns:rdf="http://www.w3.org/1999/02/22-rdf-syntax-ns#"
   xmlns:svg="http://www.w3.org/2000/svg"
   xmlns="http://www.w3.org/2000/svg"
   xmlns:xlink="http://www.w3.org/1999/xlink"
   xmlns:sodipodi="http://sodipodi.sourceforge.net/DTD/sodipodi-0.dtd"
   xmlns:inkscape="http://www.inkscape.org/namespaces/inkscape"
   width="210mm"
   height="297mm"
   viewBox="0 0 744.09448819 1052.3622047"
   id="svg2"
   version="1.1"
   inkscape:version="0.91 r13725"
   sodipodi:docname="svisimboli.svg">
  <defs
     id="defs4">
    <symbol
       id="Xor_Gate">
      <title
         id="title8003">Xor Gate</title>
      <path
         d="M 24.65625,70 45,70 C 65,70 75,50 75,50 75,50 70,30 45,30 l -20.34375,0 c 1.789926,3.094188 3.151364,6.453471 4.0625,10 C 29.54012,43.197121 30,46.545819 30,50 30,53.454181 29.54012,56.802879 28.71875,60 27.807614,63.546529 26.446176,66.905812 24.65625,70 Z"
         id="path8005" />
      <path
         d="M 18.65625,70 C 22.629549,64.322431 25,57.455703 25,50 25,42.544297 22.629549,35.677569 18.65625,30"
         id="path8007" />
    </symbol>
    <symbol
       id="And_Gate">
      <title
         id="title8029">And Gate</title>
      <path
         d="m 25,70 0,-10 0,-10 0,-10 0,-10 30,0 C 66.045695,30 75,38.954305 75,50 75,61.045695 66.045695,70 55,70 Z"
         id="path8031" />
    </symbol>
    <symbol
       id="Not_Gate">
      <title
         id="title8039">Not Gate</title>
      <path
         style="stroke-miterlimit:2"
         d="M 25,30 75,50 25,70 25,50 Z"
         id="path8041" />
      <path
         d="m 80,50 c 0,1.380712 -1.119288,2.5 -2.5,2.5 C 76.119288,52.5 75,51.380712 75,50 75,48.619288 76.119288,47.5 77.5,47.5 78.880712,47.5 80,48.619288 80,50 Z"
         id="path8043" />
    </symbol>
    <symbol
       id="Or_Gate">
      <title
         id="title8017">Or Gate</title>
      <path
         d="M 24.65625,70 45,70 C 65,70 75,50 75,50 75,50 70,30 45,30 l -20.34375,0 c 1.789926,3.094188 3.151364,6.453471 4.0625,10 C 29.54012,43.197121 30,46.545819 30,50 30,53.454181 29.54012,56.802879 28.71875,60 27.807614,63.546529 26.446176,66.905812 24.65625,70 Z"
         id="path8019" />
    </symbol>
  </defs>
  <sodipodi:namedview
     id="base"
     pagecolor="#ffffff"
     bordercolor="#666666"
     borderopacity="1.0"
     inkscape:pageopacity="0.0"
     inkscape:pageshadow="2"
     inkscape:zoom="1.4"
     inkscape:cx="244.84098"
     inkscape:cy="596.60827"
     inkscape:document-units="px"
     inkscape:current-layer="layer1"
     showgrid="false"
     inkscape:window-width="1855"
     inkscape:window-height="1056"
     inkscape:window-x="65"
     inkscape:window-y="24"
     inkscape:window-maximized="1" />
  <metadata
     id="metadata7">
    <rdf:RDF>
      <cc:Work
         rdf:about="">
        <dc:format>image/svg+xml</dc:format>
        <dc:type
           rdf:resource="http://purl.org/dc/dcmitype/StillImage" />
        <dc:title></dc:title>
      </cc:Work>
    </rdf:RDF>
  </metadata>
  <g
     inkscape:label="Layer 1"
     inkscape:groupmode="layer"
     id="layer1">
    <rect
       style="fill:#ffffff;fill-opacity:1;stroke:#000000;stroke-width:1;stroke-miterlimit:4;stroke-dasharray:none;stroke-opacity:1"
       id="rect4136"
       width="47.477169"
       height="54.548237"
       x="133.15959"
       y="278.33664" />
    <text
       xml:space="preserve"
       style="font-style:normal;font-weight:normal;font-size:15px;line-height:125%;font-family:sans-serif;letter-spacing:0px;word-spacing:0px;fill:#000000;fill-opacity:1;stroke:none;stroke-width:1px;stroke-linecap:butt;stroke-linejoin:miter;stroke-opacity:1"
       x="141.24083"
       y="314.70215"
       id="text4138"
       sodipodi:linespacing="125%"><tspan
         sodipodi:role="line"
         id="tspan4140"
         x="141.24083"
         y="314.70215"
         style="font-size:25px">=1</tspan></text>
    <path
       style="fill:none;fill-rule:evenodd;stroke:#000000;stroke-width:1px;stroke-linecap:butt;stroke-linejoin:miter;stroke-opacity:1"
       d="m 90.526621,290.41383 42.426399,0"
       id="path4142"
       inkscape:connector-curvature="0" />
    <path
       style="fill:none;fill-rule:evenodd;stroke:#000000;stroke-width:1px;stroke-linecap:butt;stroke-linejoin:miter;stroke-opacity:1"
       d="m 90.526621,314.69811 42.426399,0"
       id="path4142-3"
       inkscape:connector-curvature="0" />
    <path
       style="fill:none;fill-rule:evenodd;stroke:#000000;stroke-width:1px;stroke-linecap:butt;stroke-linejoin:miter;stroke-opacity:1"
       d="m 180.7383,305.54423 42.4264,0"
       id="path4142-6"
       inkscape:connector-curvature="0" />
    <rect
       style="fill:#ffffff;fill-opacity:1;stroke:#000000;stroke-width:1;stroke-miterlimit:4;stroke-dasharray:none;stroke-opacity:1"
       id="rect4136-7"
       width="47.477169"
       height="54.548237"
       x="124.88536"
       y="395.08807" />
    <text
       xml:space="preserve"
       style="font-style:normal;font-weight:normal;font-size:15px;line-height:125%;font-family:sans-serif;letter-spacing:0px;word-spacing:0px;fill:#000000;fill-opacity:1;stroke:none;stroke-width:1px;stroke-linecap:butt;stroke-linejoin:miter;stroke-opacity:1"
       x="132.9666"
       y="431.45358"
       id="text4138-5"
       sodipodi:linespacing="125%"><tspan
         sodipodi:role="line"
         id="tspan4140-3"
         x="132.9666"
         y="431.45358"
         style="font-size:25px">≥1</tspan></text>
    <path
       style="fill:none;fill-rule:evenodd;stroke:#000000;stroke-width:1px;stroke-linecap:butt;stroke-linejoin:miter;stroke-opacity:1"
       d="m 82.252389,407.16528 42.426401,0"
       id="path4142-5"
       inkscape:connector-curvature="0" />
    <path
       style="fill:none;fill-rule:evenodd;stroke:#000000;stroke-width:1px;stroke-linecap:butt;stroke-linejoin:miter;stroke-opacity:1"
       d="m 82.252389,431.44956 42.426401,0"
       id="path4142-3-6"
       inkscape:connector-curvature="0" />
    <path
       style="fill:none;fill-rule:evenodd;stroke:#000000;stroke-width:1px;stroke-linecap:butt;stroke-linejoin:miter;stroke-opacity:1"
       d="m 172.46407,422.29568 42.4264,0"
       id="path4142-6-2"
       inkscape:connector-curvature="0" />
    <use
       id="use8190"
       style="fill:none;stroke:#000000;stroke-width:2"
       xlink:href="#Xor_Gate"
       x="0"
       y="0"
       width="100%"
       height="100%"
       transform="translate(379.48017,407.3622)" />
    <use
       id="use8217"
       style="fill:none;stroke:#000000;stroke-width:2"
       xlink:href="#And_Gate"
       x="0"
       y="0"
       width="100%"
       height="100%"
       transform="translate(381.42857,310.93363)" />
    <use
       id="use8243"
       style="fill:none;stroke:#000000;stroke-width:2"
       xlink:href="#Not_Gate"
       x="0"
       y="0"
       width="100%"
       height="100%"
       transform="translate(372.5,236.64792)" />
    <use
       id="use8270"
       style="fill:none;stroke:#000000;stroke-width:2"
       xlink:href="#Or_Gate"
       x="0"
       y="0"
       width="100%"
       height="100%"
       transform="translate(372.65167,497.3622)" />
    <rect
       style="fill:#ffffff;fill-opacity:1;stroke:#000000;stroke-width:1;stroke-miterlimit:4;stroke-dasharray:none;stroke-opacity:1"
       id="rect4136-9"
       width="47.477169"
       height="54.548237"
       x="131.31393"
       y="497.94522" />
    <text
       xml:space="preserve"
       style="font-style:normal;font-weight:normal;font-size:15px;line-height:125%;font-family:sans-serif;letter-spacing:0px;word-spacing:0px;fill:#000000;fill-opacity:1;stroke:none;stroke-width:1px;stroke-linecap:butt;stroke-linejoin:miter;stroke-opacity:1"
       x="145.39517"
       y="534.31073"
       id="text4138-1"
       sodipodi:linespacing="125%"><tspan
         sodipodi:role="line"
         id="tspan4140-2"
         x="145.39517"
         y="534.31073"
         style="font-size:25px">&amp;</tspan></text>
    <path
       style="fill:none;fill-rule:evenodd;stroke:#000000;stroke-width:1px;stroke-linecap:butt;stroke-linejoin:miter;stroke-opacity:1"
       d="m 88.68096,510.02242 42.4264,0"
       id="path4142-7"
       inkscape:connector-curvature="0" />
    <path
       style="fill:none;fill-rule:evenodd;stroke:#000000;stroke-width:1px;stroke-linecap:butt;stroke-linejoin:miter;stroke-opacity:1"
       d="m 88.68096,534.3067 42.4264,0"
       id="path4142-3-0"
       inkscape:connector-curvature="0" />
    <path
       style="fill:none;fill-rule:evenodd;stroke:#000000;stroke-width:1px;stroke-linecap:butt;stroke-linejoin:miter;stroke-opacity:1"
       d="m 178.89264,525.15282 42.4264,0"
       id="path4142-6-9"
       inkscape:connector-curvature="0" />
    <rect
       style="fill:#ffffff;fill-opacity:1;stroke:#000000;stroke-width:1;stroke-miterlimit:4;stroke-dasharray:none;stroke-opacity:1"
       id="rect4136-3"
       width="47.477169"
       height="54.548237"
       x="132.74251"
       y="589.37378" />
    <text
       xml:space="preserve"
       style="font-style:normal;font-weight:normal;font-size:15px;line-height:125%;font-family:sans-serif;letter-spacing:0px;word-spacing:0px;fill:#000000;fill-opacity:1;stroke:none;stroke-width:1px;stroke-linecap:butt;stroke-linejoin:miter;stroke-opacity:1"
       x="150.82375"
       y="625.73932"
       id="text4138-6"
       sodipodi:linespacing="125%"><tspan
         sodipodi:role="line"
         id="tspan4140-0"
         x="150.82375"
         y="625.73932"
         style="font-size:25px">1</tspan></text>
    <path
       style="fill:none;fill-rule:evenodd;stroke:#000000;stroke-width:1px;stroke-linecap:butt;stroke-linejoin:miter;stroke-opacity:1"
       d="m 90.10953,616.55596 42.4264,0"
       id="path4142-3-61"
       inkscape:connector-curvature="0" />
    <path
       style="fill:none;fill-rule:evenodd;stroke:#000000;stroke-width:1px;stroke-linecap:butt;stroke-linejoin:miter;stroke-opacity:1"
       d="m 180.32121,616.58139 42.4264,0"
       id="path4142-6-8"
       inkscape:connector-curvature="0" />
    <circle
       style="fill:#ffffff;fill-opacity:1;stroke:#000000;stroke-width:1;stroke-miterlimit:4;stroke-dasharray:none;stroke-opacity:1"
       id="path8344"
       cx="184.2634"
       cy="616.53632"
       r="3.28125" />
    <path
       style="fill:none;fill-rule:evenodd;stroke:#000000;stroke-width:1px;stroke-linecap:butt;stroke-linejoin:miter;stroke-opacity:1"
       d="m 363.99478,347.84633 42.4264,0"
       id="path4142-2"
       inkscape:connector-curvature="0" />
    <path
       style="fill:none;fill-rule:evenodd;stroke:#000000;stroke-width:1px;stroke-linecap:butt;stroke-linejoin:miter;stroke-opacity:1"
       d="m 363.99478,372.13061 42.4264,0"
       id="path4142-3-02"
       inkscape:connector-curvature="0" />
    <path
       style="fill:none;fill-rule:evenodd;stroke:#000000;stroke-width:1px;stroke-linecap:butt;stroke-linejoin:miter;stroke-opacity:1"
       d="m 456.69122,361.60808 42.4264,0"
       id="path4142-6-3"
       inkscape:connector-curvature="0" />
    <path
       style="fill:none;fill-rule:evenodd;stroke:#000000;stroke-width:1px;stroke-linecap:butt;stroke-linejoin:miter;stroke-opacity:1"
       d="m 358.80861,535.90142 42.4264,0"
       id="path4142-2-7"
       inkscape:connector-curvature="0" />
    <path
       style="fill:none;fill-rule:evenodd;stroke:#000000;stroke-width:1px;stroke-linecap:butt;stroke-linejoin:miter;stroke-opacity:1"
       d="m 358.80861,557.78657 42.4264,0"
       id="path4142-3-02-5"
       inkscape:connector-curvature="0" />
    <path
       style="fill:none;fill-rule:evenodd;stroke:#000000;stroke-width:1px;stroke-linecap:butt;stroke-linejoin:miter;stroke-opacity:1"
       d="m 447.50505,547.26404 42.4264,0"
       id="path4142-6-3-9"
       inkscape:connector-curvature="0" />
    <path
       style="fill:none;fill-rule:evenodd;stroke:#000000;stroke-width:1px;stroke-linecap:butt;stroke-linejoin:miter;stroke-opacity:1"
       d="m 360.00595,445.11396 42.4264,0"
       id="path4142-2-2"
       inkscape:connector-curvature="0" />
    <path
       style="fill:none;fill-rule:evenodd;stroke:#000000;stroke-width:1px;stroke-linecap:butt;stroke-linejoin:miter;stroke-opacity:1"
       d="m 360.00595,467.25165 42.4264,0"
       id="path4142-3-02-2"
       inkscape:connector-curvature="0" />
    <path
       style="fill:none;fill-rule:evenodd;stroke:#000000;stroke-width:1px;stroke-linecap:butt;stroke-linejoin:miter;stroke-opacity:1"
       d="m 454.70239,456.72912 42.4264,0"
       id="path4142-6-3-8"
       inkscape:connector-curvature="0" />
    <path
       style="fill:none;fill-rule:evenodd;stroke:#000000;stroke-width:1px;stroke-linecap:butt;stroke-linejoin:miter;stroke-opacity:1"
       d="m 354.93437,286.60421 42.4264,0"
       id="path4142-2-9"
       inkscape:connector-curvature="0" />
    <path
       style="fill:none;fill-rule:evenodd;stroke:#000000;stroke-width:1px;stroke-linecap:butt;stroke-linejoin:miter;stroke-opacity:1"
       d="m 452.68208,286.7289 42.4264,0"
       id="path4142-6-3-7"
       inkscape:connector-curvature="0" />
  </g>
</svg>
