<?xml version="1.0" encoding="UTF-8" standalone="no"?>
<svg
   xmlns:dc="http://purl.org/dc/elements/1.1/"
   xmlns:cc="http://creativecommons.org/ns#"
   xmlns:rdf="http://www.w3.org/1999/02/22-rdf-syntax-ns#"
   xmlns:svg="http://www.w3.org/2000/svg"
   xmlns="http://www.w3.org/2000/svg"
   version="1.1"
   id="svg51759"
   viewBox="0 0 238.55427 234.53694"
   height="66.191536mm"
   width="67.325317mm">
  <defs
     id="defs51761" />
  <metadata
     id="metadata51764">
    <rdf:RDF>
      <cc:Work
         rdf:about="">
        <dc:format>image/svg+xml</dc:format>
        <dc:type
           rdf:resource="http://purl.org/dc/dcmitype/StillImage" />
        <dc:title></dc:title>
      </cc:Work>
    </rdf:RDF>
  </metadata>
  <g
     transform="translate(-249.29429,-360.80801)"
     id="layer1">
    <rect
       y="406.39624"
       x="297.16998"
       height="40"
       width="40"
       id="rect8070-6-5-9-0"
       style="fill:#ffffff;fill-opacity:1;stroke:#000000;stroke-width:1;stroke-miterlimit:4;stroke-dasharray:none;stroke-opacity:1" />
    <rect
       y="447.11053"
       x="297.16998"
       height="40"
       width="40"
       id="rect8070-3-7-6-2-6"
       style="fill:#ffffff;fill-opacity:1;stroke:#000000;stroke-width:1;stroke-miterlimit:4;stroke-dasharray:none;stroke-opacity:1" />
    <rect
       y="406.3963"
       x="337.52713"
       height="40"
       width="40"
       id="rect8070-5-2-0-4"
       style="fill:#ffffff;fill-opacity:1;stroke:#000000;stroke-width:1;stroke-miterlimit:4;stroke-dasharray:none;stroke-opacity:1" />
    <rect
       y="447.11053"
       x="337.52713"
       height="40"
       width="40"
       id="rect8070-3-3-9-2-6"
       style="fill:#ffffff;fill-opacity:1;stroke:#000000;stroke-width:1;stroke-miterlimit:4;stroke-dasharray:none;stroke-opacity:1" />
    <rect
       y="406.39624"
       x="376.81284"
       height="40"
       width="40"
       id="rect8070-6-1-3-2"
       style="fill:#ffffff;fill-opacity:1;stroke:#000000;stroke-width:1;stroke-miterlimit:4;stroke-dasharray:none;stroke-opacity:1" />
    <rect
       y="447.11053"
       x="376.81284"
       height="40"
       width="40"
       id="rect8070-3-7-2-7-5"
       style="fill:#ffffff;fill-opacity:1;stroke:#000000;stroke-width:1;stroke-miterlimit:4;stroke-dasharray:none;stroke-opacity:1" />
    <rect
       y="406.3963"
       x="417.17001"
       height="40"
       width="40"
       id="rect8070-5-7-5-8"
       style="fill:#ffffff;fill-opacity:1;stroke:#000000;stroke-width:1;stroke-miterlimit:4;stroke-dasharray:none;stroke-opacity:1" />
    <rect
       y="447.11053"
       x="417.17001"
       height="40"
       width="40"
       id="rect8070-3-3-0-9-6"
       style="fill:#ffffff;fill-opacity:1;stroke:#000000;stroke-width:1;stroke-miterlimit:4;stroke-dasharray:none;stroke-opacity:1" />
    <rect
       y="486.75336"
       x="297.16998"
       height="40"
       width="40"
       id="rect8070-6-5-2-2"
       style="fill:#ffffff;fill-opacity:1;stroke:#000000;stroke-width:1;stroke-miterlimit:4;stroke-dasharray:none;stroke-opacity:1" />
    <rect
       y="527.46765"
       x="297.16998"
       height="40"
       width="40"
       id="rect8070-3-7-6-28-8"
       style="fill:#ffffff;fill-opacity:1;stroke:#000000;stroke-width:1;stroke-miterlimit:4;stroke-dasharray:none;stroke-opacity:1" />
    <rect
       y="486.75342"
       x="337.52713"
       height="40"
       width="40"
       id="rect8070-5-2-9-4"
       style="fill:#ffffff;fill-opacity:1;stroke:#000000;stroke-width:1;stroke-miterlimit:4;stroke-dasharray:none;stroke-opacity:1" />
    <rect
       y="527.46765"
       x="337.52713"
       height="40"
       width="40"
       id="rect8070-3-3-9-7-7"
       style="fill:#ffffff;fill-opacity:1;stroke:#000000;stroke-width:1;stroke-miterlimit:4;stroke-dasharray:none;stroke-opacity:1" />
    <rect
       y="486.75336"
       x="376.81284"
       height="40"
       width="40"
       id="rect8070-6-1-36-2"
       style="fill:#ffffff;fill-opacity:1;stroke:#000000;stroke-width:1;stroke-miterlimit:4;stroke-dasharray:none;stroke-opacity:1" />
    <rect
       y="527.46765"
       x="376.81284"
       height="40"
       width="40"
       id="rect8070-3-7-2-1-4"
       style="fill:#ffffff;fill-opacity:1;stroke:#000000;stroke-width:1;stroke-miterlimit:4;stroke-dasharray:none;stroke-opacity:1" />
    <rect
       y="486.75342"
       x="417.17001"
       height="40"
       width="40"
       id="rect8070-5-7-2-0"
       style="fill:#ffffff;fill-opacity:1;stroke:#000000;stroke-width:1;stroke-miterlimit:4;stroke-dasharray:none;stroke-opacity:1" />
    <rect
       y="527.46765"
       x="417.17001"
       height="40"
       width="40"
       id="rect8070-3-3-0-93-6"
       style="fill:#ffffff;fill-opacity:1;stroke:#000000;stroke-width:1;stroke-miterlimit:4;stroke-dasharray:none;stroke-opacity:1" />
    <text
       id="text8315-6-2"
       y="401.41846"
       x="307.92889"
       style="font-style:normal;font-weight:normal;font-size:15px;line-height:125%;font-family:sans-serif;letter-spacing:0px;word-spacing:0px;fill:#000000;fill-opacity:1;stroke:none;stroke-width:1px;stroke-linecap:butt;stroke-linejoin:miter;stroke-opacity:1"
       xml:space="preserve"><tspan
         y="401.41846"
         x="307.92889"
         id="tspan8317-9-9">00</tspan></text>
    <text
       id="text8319-3-9"
       y="401.41846"
       x="348.23285"
       style="font-style:normal;font-weight:normal;font-size:15px;line-height:125%;font-family:sans-serif;letter-spacing:0px;word-spacing:0px;fill:#000000;fill-opacity:1;stroke:none;stroke-width:1px;stroke-linecap:butt;stroke-linejoin:miter;stroke-opacity:1"
       xml:space="preserve"><tspan
         y="401.41846"
         x="348.23285"
         id="tspan8321-7-0">01</tspan></text>
    <text
       id="text8323-4-8"
       y="401.42578"
       x="388.01315"
       style="font-style:normal;font-weight:normal;font-size:15px;line-height:125%;font-family:sans-serif;letter-spacing:0px;word-spacing:0px;fill:#000000;fill-opacity:1;stroke:none;stroke-width:1px;stroke-linecap:butt;stroke-linejoin:miter;stroke-opacity:1"
       xml:space="preserve"><tspan
         y="401.42578"
         x="388.01315"
         id="tspan8325-5-1">11</tspan></text>
    <text
       id="text8327-2-3"
       y="401.41846"
       x="427.92892"
       style="font-style:normal;font-weight:normal;font-size:15px;line-height:125%;font-family:sans-serif;letter-spacing:0px;word-spacing:0px;fill:#000000;fill-opacity:1;stroke:none;stroke-width:1px;stroke-linecap:butt;stroke-linejoin:miter;stroke-opacity:1"
       xml:space="preserve"><tspan
         y="401.41846"
         x="427.92892"
         id="tspan8329-5-1">10</tspan></text>
    <text
       id="text8331-4-1"
       y="426.85754"
       x="272.64081"
       style="font-style:normal;font-weight:normal;font-size:15px;line-height:125%;font-family:sans-serif;letter-spacing:0px;word-spacing:0px;fill:#000000;fill-opacity:1;stroke:none;stroke-width:1px;stroke-linecap:butt;stroke-linejoin:miter;stroke-opacity:1"
       xml:space="preserve"><tspan
         y="426.85754"
         x="272.64081"
         id="tspan8333-7-0">00</tspan></text>
    <text
       id="text8335-4-3"
       y="468.86096"
       x="272.8349"
       style="font-style:normal;font-weight:normal;font-size:15px;line-height:125%;font-family:sans-serif;letter-spacing:0px;word-spacing:0px;fill:#000000;fill-opacity:1;stroke:none;stroke-width:1px;stroke-linecap:butt;stroke-linejoin:miter;stroke-opacity:1"
       xml:space="preserve"><tspan
         y="468.86096"
         x="272.8349"
         id="tspan8337-4-4">01</tspan></text>
    <text
       id="text8339-3-0"
       y="510.87164"
       x="272.50531"
       style="font-style:normal;font-weight:normal;font-size:15px;line-height:125%;font-family:sans-serif;letter-spacing:0px;word-spacing:0px;fill:#000000;fill-opacity:1;stroke:none;stroke-width:1px;stroke-linecap:butt;stroke-linejoin:miter;stroke-opacity:1"
       xml:space="preserve"><tspan
         y="510.87164"
         x="272.50531"
         id="tspan8341-0-3">11</tspan></text>
    <text
       id="text8343-7-9"
       y="552.86768"
       x="272.31122"
       style="font-style:normal;font-weight:normal;font-size:15px;line-height:125%;font-family:sans-serif;letter-spacing:0px;word-spacing:0px;fill:#000000;fill-opacity:1;stroke:none;stroke-width:1px;stroke-linecap:butt;stroke-linejoin:miter;stroke-opacity:1"
       xml:space="preserve"><tspan
         y="552.86768"
         x="272.31122"
         id="tspan8345-8-1">10</tspan></text>
    <path
       id="path8419-9"
       d="m 297.16999,406.7534 -15,-15"
       style="fill:none;fill-rule:evenodd;stroke:#000000;stroke-width:1px;stroke-linecap:butt;stroke-linejoin:miter;stroke-opacity:1" />
    <text
       id="text8474-6"
       y="401.75342"
       x="257.16998"
       style="font-style:normal;font-weight:normal;font-size:15px;line-height:125%;font-family:sans-serif;letter-spacing:0px;word-spacing:0px;fill:#000000;fill-opacity:1;stroke:none;stroke-width:1px;stroke-linecap:butt;stroke-linejoin:miter;stroke-opacity:1"
       xml:space="preserve"><tspan
         y="401.75342"
         x="257.16998"
         id="tspan8476-9">CD</tspan></text>
    <text
       id="text8478-3"
       y="386.8042"
       x="284.13953"
       style="font-style:normal;font-weight:normal;font-size:15px;line-height:125%;font-family:sans-serif;letter-spacing:0px;word-spacing:0px;fill:#000000;fill-opacity:1;stroke:none;stroke-width:1px;stroke-linecap:butt;stroke-linejoin:miter;stroke-opacity:1"
       xml:space="preserve"><tspan
         y="386.8042"
         x="284.13953"
         id="tspan8480-3">AB</tspan></text>
    <path
       id="path8526-8"
       d="m 377.16999,576.7534 80,0"
       style="fill:none;fill-rule:evenodd;stroke:#000000;stroke-width:1px;stroke-linecap:butt;stroke-linejoin:miter;stroke-opacity:1" />
    <path
       id="path8528-0"
       d="m 467.16999,486.7534 0,80"
       style="fill:none;fill-rule:evenodd;stroke:#000000;stroke-width:1px;stroke-linecap:butt;stroke-linejoin:miter;stroke-opacity:1" />
    <path
       id="path8530-5"
       d="m 337.16999,381.7534 80,0"
       style="fill:none;fill-rule:evenodd;stroke:#000000;stroke-width:1px;stroke-linecap:butt;stroke-linejoin:miter;stroke-opacity:1" />
    <path
       id="path8532-6"
       d="m 267.16999,446.7534 0,80"
       style="fill:none;fill-rule:evenodd;stroke:#000000;stroke-width:1px;stroke-linecap:butt;stroke-linejoin:miter;stroke-opacity:1" />
    <text
       id="text8454-04-6"
       y="534.73309"
       x="474.64462"
       style="font-style:normal;font-weight:normal;font-size:15px;line-height:125%;font-family:sans-serif;letter-spacing:0px;word-spacing:0px;fill:#000000;fill-opacity:1;stroke:none;stroke-width:1px;stroke-linecap:butt;stroke-linejoin:miter;stroke-opacity:1"
       xml:space="preserve"><tspan
         y="534.73309"
         x="474.64462"
         id="tspan8456-8-4">C</tspan></text>
    <text
       id="text8454-7-0"
       y="489.27625"
       x="251.36543"
       style="font-style:normal;font-weight:normal;font-size:15px;line-height:125%;font-family:sans-serif;letter-spacing:0px;word-spacing:0px;fill:#000000;fill-opacity:1;stroke:none;stroke-width:1px;stroke-linecap:butt;stroke-linejoin:miter;stroke-opacity:1"
       xml:space="preserve"><tspan
         y="489.27625"
         x="251.36543"
         id="tspan8456-1-04">D</tspan></text>
    <text
       id="text8454-7-6-6"
       y="591.80164"
       x="413.38577"
       style="font-style:normal;font-weight:normal;font-size:15px;line-height:125%;font-family:sans-serif;letter-spacing:0px;word-spacing:0px;fill:#000000;fill-opacity:1;stroke:none;stroke-width:1px;stroke-linecap:butt;stroke-linejoin:miter;stroke-opacity:1"
       xml:space="preserve"><tspan
         y="591.80164"
         x="413.38577"
         id="tspan8456-1-1-2">A</tspan></text>
    <text
       id="text8454-7-6-4-6"
       y="375.28638"
       x="375.86038"
       style="font-style:normal;font-weight:normal;font-size:15px;line-height:125%;font-family:sans-serif;letter-spacing:0px;word-spacing:0px;fill:#000000;fill-opacity:1;stroke:none;stroke-width:1px;stroke-linecap:butt;stroke-linejoin:miter;stroke-opacity:1"
       xml:space="preserve"><tspan
         y="375.28638"
         x="375.86038"
         id="tspan8456-1-1-90-7">B</tspan></text>
    <text
       id="text8767-5"
       y="430.87079"
       x="313.18015"
       style="font-style:normal;font-weight:normal;font-size:15px;line-height:125%;font-family:sans-serif;letter-spacing:0px;word-spacing:0px;fill:#000000;fill-opacity:1;stroke:none;stroke-width:1px;stroke-linecap:butt;stroke-linejoin:miter;stroke-opacity:1"
       xml:space="preserve"><tspan
         y="430.87079"
         x="313.18015"
         id="tspan8769-6">0</tspan></text>
    <text
       id="text8771-9"
       y="430.87811"
       x="352.62512"
       style="font-style:normal;font-weight:normal;font-size:15px;line-height:125%;font-family:sans-serif;letter-spacing:0px;word-spacing:0px;fill:#000000;fill-opacity:1;stroke:none;stroke-width:1px;stroke-linecap:butt;stroke-linejoin:miter;stroke-opacity:1"
       xml:space="preserve"><tspan
         y="430.87811"
         x="352.62512"
         id="tspan8773-8">4</tspan></text>
    <text
       id="text8775-7"
       y="430.87079"
       x="433.63449"
       style="font-style:normal;font-weight:normal;font-size:15px;line-height:125%;font-family:sans-serif;letter-spacing:0px;word-spacing:0px;fill:#000000;fill-opacity:1;stroke:none;stroke-width:1px;stroke-linecap:butt;stroke-linejoin:miter;stroke-opacity:1"
       xml:space="preserve"><tspan
         y="430.87079"
         x="433.63449"
         id="tspan8777-2">8</tspan></text>
    <text
       id="text8779-8"
       y="430.97699"
       x="387.06339"
       style="font-style:normal;font-weight:normal;font-size:15px;line-height:125%;font-family:sans-serif;letter-spacing:0px;word-spacing:0px;fill:#000000;fill-opacity:1;stroke:none;stroke-width:1px;stroke-linecap:butt;stroke-linejoin:miter;stroke-opacity:1"
       xml:space="preserve"><tspan
         y="430.97699"
         x="387.06339"
         id="tspan8781-2">12</tspan></text>
    <text
       id="text8783-9"
       y="469.74207"
       x="311.71567"
       style="font-style:normal;font-weight:normal;font-size:15px;line-height:125%;font-family:sans-serif;letter-spacing:0px;word-spacing:0px;fill:#000000;fill-opacity:1;stroke:none;stroke-width:1px;stroke-linecap:butt;stroke-linejoin:miter;stroke-opacity:1"
       xml:space="preserve"><tspan
         y="469.74207"
         x="311.71567"
         id="tspan8785-9">1</tspan></text>
    <text
       id="text8787-6"
       y="469.63589"
       x="351.9967"
       style="font-style:normal;font-weight:normal;font-size:15px;line-height:125%;font-family:sans-serif;letter-spacing:0px;word-spacing:0px;fill:#000000;fill-opacity:1;stroke:none;stroke-width:1px;stroke-linecap:butt;stroke-linejoin:miter;stroke-opacity:1"
       xml:space="preserve"><tspan
         y="469.63589"
         x="351.9967"
         id="tspan8789-0">5</tspan></text>
    <text
       id="text8791-2"
       y="469.73474"
       x="432.11929"
       style="font-style:normal;font-weight:normal;font-size:15px;line-height:125%;font-family:sans-serif;letter-spacing:0px;word-spacing:0px;fill:#000000;fill-opacity:1;stroke:none;stroke-width:1px;stroke-linecap:butt;stroke-linejoin:miter;stroke-opacity:1"
       xml:space="preserve"><tspan
         y="469.73474"
         x="432.11929"
         id="tspan8793-7">9</tspan></text>
    <text
       id="text8795-6"
       y="469.73474"
       x="386.99332"
       style="font-style:normal;font-weight:normal;font-size:15px;line-height:125%;font-family:sans-serif;letter-spacing:0px;word-spacing:0px;fill:#000000;fill-opacity:1;stroke:none;stroke-width:1px;stroke-linecap:butt;stroke-linejoin:miter;stroke-opacity:1"
       xml:space="preserve"><tspan
         y="469.73474"
         x="386.99332"
         id="tspan8797-1">13</tspan></text>
    <text
       id="text8799-3"
       y="552.5918"
       x="311.41238"
       style="font-style:normal;font-weight:normal;font-size:15px;line-height:125%;font-family:sans-serif;letter-spacing:0px;word-spacing:0px;fill:#000000;fill-opacity:1;stroke:none;stroke-width:1px;stroke-linecap:butt;stroke-linejoin:miter;stroke-opacity:1"
       xml:space="preserve"><tspan
         y="552.5918"
         x="311.41238"
         id="tspan8801-2">2</tspan></text>
    <text
       id="text8803-1"
       y="552.4856"
       x="351.49628"
       style="font-style:normal;font-weight:normal;font-size:15px;line-height:125%;font-family:sans-serif;letter-spacing:0px;word-spacing:0px;fill:#000000;fill-opacity:1;stroke:none;stroke-width:1px;stroke-linecap:butt;stroke-linejoin:miter;stroke-opacity:1"
       xml:space="preserve"><tspan
         y="552.4856"
         x="351.49628"
         id="tspan8805-5">6</tspan></text>
    <text
       id="text8807-9"
       y="552.4856"
       x="427.11929"
       style="font-style:normal;font-weight:normal;font-size:15px;line-height:125%;font-family:sans-serif;letter-spacing:0px;word-spacing:0px;fill:#000000;fill-opacity:1;stroke:none;stroke-width:1px;stroke-linecap:butt;stroke-linejoin:miter;stroke-opacity:1"
       xml:space="preserve"><tspan
         y="552.4856"
         x="427.11929"
         id="tspan8809-9">10</tspan></text>
    <text
       id="text8811-1"
       y="552.49292"
       x="386.70584"
       style="font-style:normal;font-weight:normal;font-size:15px;line-height:125%;font-family:sans-serif;letter-spacing:0px;word-spacing:0px;fill:#000000;fill-opacity:1;stroke:none;stroke-width:1px;stroke-linecap:butt;stroke-linejoin:miter;stroke-opacity:1"
       xml:space="preserve"><tspan
         y="552.49292"
         x="386.70584"
         id="tspan8813-4">14</tspan></text>
    <text
       id="text8815-9"
       y="511.52991"
       x="310.95807"
       style="font-style:normal;font-weight:normal;font-size:15px;line-height:125%;font-family:sans-serif;letter-spacing:0px;word-spacing:0px;fill:#000000;fill-opacity:1;stroke:none;stroke-width:1px;stroke-linecap:butt;stroke-linejoin:miter;stroke-opacity:1"
       xml:space="preserve"><tspan
         y="511.52991"
         x="310.95807"
         id="tspan8817-1">3</tspan></text>
    <text
       id="text8819-0"
       y="511.53723"
       x="351.65704"
       style="font-style:normal;font-weight:normal;font-size:15px;line-height:125%;font-family:sans-serif;letter-spacing:0px;word-spacing:0px;fill:#000000;fill-opacity:1;stroke:none;stroke-width:1px;stroke-linecap:butt;stroke-linejoin:miter;stroke-opacity:1"
       xml:space="preserve"><tspan
         y="511.53723"
         x="351.65704"
         id="tspan8821-7">7</tspan></text>
    <text
       id="text8823-5"
       y="511.53723"
       x="428.12943"
       style="font-style:normal;font-weight:normal;font-size:15px;line-height:125%;font-family:sans-serif;letter-spacing:0px;word-spacing:0px;fill:#000000;fill-opacity:1;stroke:none;stroke-width:1px;stroke-linecap:butt;stroke-linejoin:miter;stroke-opacity:1"
       xml:space="preserve"><tspan
         y="511.53723"
         x="428.12943"
         id="tspan8825-8">11</tspan></text>
    <text
       id="text8827-7"
       y="511.43103"
       x="387.39017"
       style="font-style:normal;font-weight:normal;font-size:15px;line-height:125%;font-family:sans-serif;letter-spacing:0px;word-spacing:0px;fill:#000000;fill-opacity:1;stroke:none;stroke-width:1px;stroke-linecap:butt;stroke-linejoin:miter;stroke-opacity:1"
       xml:space="preserve"><tspan
         y="511.43103"
         x="387.39017"
         id="tspan8829-0">15</tspan></text>
  </g>
</svg>
