   {
    "imageOnly": [
        {
            "id": 1,
            "image": "https://picsum.photos/id/1022/200/300"
          }, {
            "id": 2,
            "image": "https://picsum.photos/id/1015/200/300"
          }, {
            "id": 3,
            "image": "https://picsum.photos/id/1016/200/300"
          }, {
            "id": 4,
            "image": "https://picsum.photos/id/1018/200/300"
          }, {
            "id": 5,
            "image": "https://picsum.photos/id/1024/200/300"
          }, {
            "id": 6,
            "image": "https://picsum.photos/id/1013/200/300"
          }, {
            "id": 7,
            "image": "https://picsum.photos/id/1011/200/300"
          }
    ], 
    
    "recommendation": [
    {
      "id": 1,
      "title": "Fiona Grey",
      "sub_title": "@fionagrey",
      "image": "http://dummyimage.com/102x175.bmp/dddddd/000000",
      "content":
        "Lorem ipsum dolor sit amet, consectetur adipiscing elit, sed do eiusmod tempor incididunt ut labore et dolore magna aliqua. Ut enim ad minim veniam, quis nostrud exercitation ullamco laboris nisi ut aliquip ex ea commodo consequat."
    },
    {
      "id": 2,
      "title": "Erica Iggo",
      "sub_title": "eiggo1",
      "image": "http://dummyimage.com/155x183.jpg/cc0000/ffffff",
      "content":
        "sapien placerat ante nulla justo aliquam quis turpis eget elit sodales scelerisque mauris sit amet eros suspendisse accumsan tortor quis turpis sed ante vivamus tortor duis mattis egestas metus aenean fermentum donec ut mauris eget massa tempor convallis nulla neque"
    },
    {
      "id": 3,
      "title": "Reinald Cradock",
      "sub_title": "rcradock2",
      "image": "http://dummyimage.com/230x174.jpg/cc0000/ffffff",
      "content":
        "eros vestibulum ac est lacinia nisi venenatis tristique fusce congue diam id ornare imperdiet sapien urna pretium nisl ut volutpat sapien arcu sed augue aliquam erat volutpat in congue etiam justo etiam"
    },
    {
      "id": 4,
      "title": "Libbey Barkworth",
      "sub_title": "lbarkworth3",
      "image": "http://dummyimage.com/195x205.bmp/ff4444/ffffff",
      "content":
        "vel pede morbi porttitor lorem id ligula suspendisse ornare consequat lectus in est risus auctor sed tristique in tempus sit amet sem fusce consequat nulla nisl nunc nisl duis bibendum felis sed interdum venenatis"
    },
    {
      "id": 5,
      "title": "Isabel Stife",
      "sub_title": "istife4",
      "image": "http://dummyimage.com/244x180.png/dddddd/000000",
      "content":
        "ante nulla justo aliquam quis turpis eget elit sodales scelerisque mauris sit amet eros suspendisse accumsan tortor quis turpis sed ante vivamus tortor duis mattis egestas metus aenean fermentum donec ut mauris"
    }
]
}