{
  "ndkVersionFromDsl": "21.4.7075529",
  "ndkDirProperty": "/Users/minh.nguyen/Library/Android/sdk/ndk/21.4.7075529",
  "sdkFolder": "/Users/minh.nguyen/Library/Android/sdk",
  "sideBySideNdkFolderNames": [
    "21.4.7075529",
    "20.0.5594570"
  ]
}