{
  "type": "service_account",
  "project_id": "node-push-crash",
  "private_key_id": "da0fec2cf2271e0bf9aaed24803315a146d82a63",
  "private_key": "-----BEGIN PRIVATE KEY-----\nMIIEvAIBADANBgkqhkiG9w0BAQEFAASCBKYwggSiAgEAAoIBAQDCzi65KDNV4K5v\npXYfEkz+e4qxrMQ88fx2IZuuwgHA5EyIeO98c/6+I/v++R6gpa4cRYWRLEyGSQUd\nrKjAtvnGgGztide0ApzDrO/w47uN2h2LVQSIsJWyGbFBh1iQzh3c6fqKTtbRGG2k\nPKh/tynsE3B+IPMulOmCONNDrOqPd4384uwVBaHVWrI9lulccFQPemx4tIwJ+SFC\nmvwHef3v66z1V/NeNn9wE6Jz1qiD9R4uaRuUdLnh6KZkSF7Kv67d6DSLzh7CpbBr\n2S1flaSmv9mgwA8+AHqikIyx+12WaMzAoOd9aqUKpfEahQIsUPBzKVIN4ecOaEgZ\nIg8Pha0RAgMBAAECggEAGvSl0XgnFliHOqq2HBmPrt0QdYJ3CwnfCcefv8BXtsXA\nc1fsp5dzZgMbsQ3ut4MFgyL5lvt+wUwkWZVVKomHKXkG2Z2ry9xardblwrr4bmoC\nkY+bl4B7zk+wz+T3E955kmKMCQxcvEU5krLUDAwf0GtmMwXDMKxpXVwYm7I3KM+/\n6Z4bWeXCQMgq8/GUqHsQ1bw9iu0W1v89YFp17bjl478bMo5hZxUj7HvagCqCkX5W\nDisVZGp6SWHvtY8QnTfWGnbNWhLWHwy2+sqZEjfAVhAq7beDYs02fI5+XzXyZPTr\nfOh4UWC+gSPEv5dvbjTjT9T5U8zzBTF+AyfNhx6auQKBgQDpENe5O1+zBBBkOPAP\nUwWSKd5K2JUhx7CAP4CgsHSWB+rxUMrmKyXVz8VE1eXaWiciaotHloyywVQwIgKf\nCgMWzxkJ34ElbzTOtxRfIkNg+S8GAcw4i/vB0yGTXZkF2JanBk/BVtWwzL3QL2wv\n7TgE0MiURJslSUTcIHYdTExf1QKBgQDV+YXXy6hFjUJZ+/+aR03XZjxiAzDTQaVz\nj1Lrwd//n0FdvyB+8AEmd9Eq/JR86x+fPhUkav04+HWau0yPxMn+c8LLEB18e9sx\nhm1+0h/ffxXqTn/0C5aP2wzvQo/x1d0WgLc4iE+Y6ITHGINfi7B4b/ALWnerc1fA\n7JSbgmByTQKBgHNr6+nIBbTaJmP77qcoLnIcWgInEHQSOM7KpCDwQkyqzyeDI3ip\nlas1ojRc2eAxFYBt01w4qqU8KT1NGo84nh8FoRjKn2KymCxnbqdOiJ/Vx/vpmAHJ\nEX0D2nTovYevo6xD6+uL3XgZbUdUtPdnO37nBu6mq07j4j5BtTz9NDWhAoGARDlr\nE4M8A/EmVsqilO5nQ2a1mgqqZrFnr5DjP4hxg2+jx+BI3DBqLXnGl44xSiMt0fhZ\nhWMXmjKeTNercautPBRs55Ib1LUpDoFuKCGXSAudUTf2VDndp8CQPzlZ7CHkfGhO\nAxhzSK3aqCCIws4nVj9aqkQOI/yC3mCQgYTwe4ECgYBtunvnAhLQMyrfyQY2hG6J\nwxAPcy5AorAbK9InoIew5JNrHxLkovlFEoD5Nc9YKEV/MBkEpYiCbrcPPSN9cTyQ\nZ0GwHLOEwIZpEjW1TiLioJjYtGCuev/C+ZUtBKP75v0EEhPXoCpdSKDiQmqX9kh+\ndMtlaeeRqtbTQdas0B7gAA==\n-----END PRIVATE KEY-----\n",
  "client_email": "starting-account-knum55trl4r0@node-push-crash.iam.gserviceaccount.com",
  "client_id": "104107376466045655167",
  "auth_uri": "https://accounts.google.com/o/oauth2/auth",
  "token_uri": "https://oauth2.googleapis.com/token",
  "auth_provider_x509_cert_url": "https://www.googleapis.com/oauth2/v1/certs",
  "client_x509_cert_url": "https://www.googleapis.com/robot/v1/metadata/x509/starting-account-knum55trl4r0%40node-push-crash.iam.gserviceaccount.com"
}
