Q13442814
Q7318358
Q523
Q318
Q4167410
Q113145171
Q7187
Q16521
Q8054
Q13406463
Q1931185
Q1457376
Q17633526
Q2247863
Q27020041
Q47150325
Q29654788
Q21014462
Q2154519
Q59199015
Q115595777
Q49008
Q23038290
Q427087

Q110948787
Q15035195
Q110948800
Q110948717
Q107622616
Q110948140
Q110937151
Q111039071
Q111039618
Q111039632
Q110075991
Q110076023
Q110076072
Q110076094
Q110076109
Q110076120
Q111039713
Q110741084
Q63102783
Q110077972
Q15040398
Q29017839
Q14745284
Q340587
Q237604
Q451152
Q747347
Q616386
Q116875578
Q9262
Q3863
Q39385124
Q2327727
Q753847
Q30675096
Q25352882
Q808220
Q812800
Q816732
Q565368
Q4913879
Q3142966
Q978297
Q4917693
Q98273894
Q5855
Q1048372
Q38679472
Q1419844
Q1023342
Q1023686
Q2947186
Q1074076
Q48361
Q928495
Q5147142
Q1151284
Q1182108
Q249389
Q854857
Q947662
Q18206626
Q669420
Q13890
Q2088753
Q204194
Q1266034
Q864952
Q2035733
Q167910
Q827989
Q1188143
Q15807754
Q72802508
Q202265
Q1344401
Q1362543
Q44559
Q2578855
Q679411
Q2586037
Q1196165
Q995268
Q1353952
Q2855300
Q15809070
Q211301
Q1133705
Q430297
Q1007122
Q318
Q1491746
Q14515149
Q204107
Q22247
Q71962386
Q1196680
Q839992
Q5864
Q1519541
Q1195475
Q3414340
Q651063
Q185243
Q2964436
Q11282
Q536491
Q528404
Q631379
Q863936
Q767432
Q911809
Q1141907
Q504908
Q7631112
Q5881
Q175876
Q1044693
Q50048
Q737302
Q1621824
Q72803426
Q420490
Q108308004
Q4188
Q231982
Q1036344
Q5968272
Q15075070
Q5971190
Q1565388
Q67206691
Q13205267
Q986563
Q4288708
Q41872
Q36956983
Q5920047
Q284657
Q497654
Q15121300
Q61702557
Q1103085
Q1721861
Q1059564
Q14468623
Q193275
Q1022867
Q2332332
Q862203
Q130019
Q1062169
Q3559
Q368442
Q1430362
Q15975398
Q3003861
Q11276
Q54231466
Q2964429
Q2964430
Q11752333
Q1783528
Q2945326
Q15057366
Q351051
Q115518
Q2557101
Q1872802
Q1074920
Q1457669
Q6770568
Q913970
Q177268
Q2420453
Q5769264
Q17325117
Q957798
Q947207
Q60186
Q7012
Q609501
Q1028022
Q14605250
Q2140232
Q272447
Q2537
Q1056935
Q952474
Q6960589
Q1125935
Q1547772
Q42372
Q2139
Q4202
Q1222876
Q5886
Q2007502
Q30249972
Q30250610
Q400144
Q97166449
Q2296748
Q3351580
Q4235016
Q1352333
Q1045138
Q4228437
Q787067
Q245701
Q1067440
Q1142192
Q634
Q179792
Q206717
Q389824
Q1752077
Q662656
Q1436016
Q1062509
Q13426235
Q64286159
Q849009
Q204903
Q336907
Q1142835
Q1810024
Q27818885
Q1151877
Q1439884
Q876712
Q1140275
Q114553321
Q1392913
Q217012
Q1931185
Q55631336
Q203958
Q1316152
Q2152311
Q3346004
Q21857994
Q5875
Q28951811
Q1894471
Q2168098
Q50081
Q5893
Q5898
Q462326
Q2175717
Q769363
Q1407562
Q5961
Q1782562
Q2154519
Q26540
Q1297322
Q2495
Q1972
Q49001657
Q96148782
Q2247863
Q3540844
Q15731960
Q213930
Q112881
Q2311038
Q564946
Q726611
Q1751315
Q1640168
Q523
Q3592493
Q16685897
Q10458671
Q2331666
Q736194
Q8928
Q56425403
Q168845
Q1000207
Q595871
Q3237390
Q1059884
Q2568452
Q1504097
Q1073768
Q1060667
Q83148567
Q327757
Q27521
Q3937
Q1049029
Q582000
Q207436
Q650001
Q30892338
Q2296150
Q7825074
Q2803875
Q19635
Q1359002
Q23807878
Q1326555
Q1079825
Q24039974
Q129686
Q56283577
Q18357230
Q1141054
Q6227
Q6220
Q2152
Q845371
Q11176
Q5871
Q131468
Q9328551
Q1473823
Q275450
Q9283096
Q6251
Q7544
Q12115
Q190438
Q2199
Q29370670
Q244393
Q46587
Q109645909
Q1341811
Q1457376
Q5848
Q101600
Q2495963
Q184348
Q265392
Q128207
Q123991699
Q15053549
Q54231557
Q1620914
Q382979
Q53151979
Q1974542
Q5961276
Q5961257
Q3504248
Q2504088
Q2731563
Q1054444
Q53953381
Q2441216
Q190397
Q1707270
Q1250298
Q193384
Q1153690
Q1050633
Q878367
Q11387
Q50053
Q13632
Q1155939
Q505781
Q2035809
Q353834
Q1094364
Q1371025
Q5976
Q589
Q27231639
Q1993624
Q1047034
Q3132741
Q4021955
Q20149294
Q40392
Q18393176
Q6592
Q16945799
Q18611609
Q72053253
Q6243
Q644507
Q2271256
Q205901
Q3235978
Q43001876
Q193599
Q30014
Q79076590
Q79076513
Q43186159
Q471805
Q43184936
Q12873407
Q771898
Q43195930
Q14745279
Q43185343
Q43185532
Q664990
Q4645995
Q63351700
Q116875582
Q4953289
Q104532912
Q1202702
Q104530711
Q25349077
Q104530641
Q109000788
Q1002787
Q1826065
Q104853025
Q3089004
Q109367384
Q43195985
Q43185125
Q3094528
Q5506321
Q43196103
Q43196781
Q43185423
Q43185685
Q285924
Q3391592
Q17019140
Q67201586
Q65042498
Q120621195
Q120621196
Q12874144
Q3089434
Q5971169
Q6044968
Q7833672
Q125255587
Q43196853
Q43185281
Q43185998
Q6354678
Q27334437
Q4396596
Q11878917
Q43196886
Q4350564
Q6707993
Q43196227
Q43196599
Q1161161
Q43196940
Q78801380
Q3772242
Q20919553
Q1211496
Q43196310
Q43185226
Q43185897
Q60773904
Q6048400
Q123984677
Q11801963
Q71928
Q3721474
Q63351687
Q1153392
Q1081175
Q122199249
Q11702990
Q7703309
Q1131585
Q108336434
Q71798788
Q2269733
Q28064310
Q8041584
Q9283175
Q3320505
Q4071774
Q11853210
Q987046
Q15240495
Q2722426
Q12053157
Q96619132
Q9298968
Q125501085
Q16910803
Q123232951
Q71798532
Q72704237
Q67201524
Q16256303
Q1067416
Q1012875
Q3388369
Q5359407
Q844866
Q4229985
Q70317290
Q2716249
Q5164823
Q3278193
Q5212927
Q5223555
Q123232826
Q97570336
Q5282923
Q5308465
Q72534536
Q72803622
Q5416058
Q15218857
Q5420737
Q113590313
Q1765388
Q5422256
Q71242916
Q5422262
Q2601295
Q71797766
Q124031296
Q67206701
Q1027098
Q116452165
Q15922837
Q57653804
Q17119317
Q13424716
Q71962637
Q17019210
Q97172577
Q96380207
Q1191404
Q845169
Q12021156
Q12021160
Q80796829
Q5985491
Q12060742
Q4391268
Q113123664
Q117207248
Q113123742
Q911245
Q123161941
Q12795622
Q6731527
Q6808594
Q67201491
Q67201561
Q3850883
Q1274946
Q1132863
Q67206785
Q3037794
Q565309
Q2014003
Q7187739
Q72534196
Q16873378
Q367831
Q17631479
Q118322733
Q72054258
Q72053617
Q72803708
Q72533545
Q72802810
Q72802727
Q66619774
Q7243056
Q70073069
Q24020774
Q911454
Q7281159
Q5677952
Q66619666
Q125622386
Q19606404
Q2331877
Q25346003
Q5475239
Q109101277
Q27150479
Q7624558
Q15129745
Q97359320
Q67201574
Q1207898
Q124481229
Q14801035
Q123739468
Q2318940
Q66521853
Q72672560
Q1351748
Q65551241
Q847083
Q115772494
Q2469993
Q2311388
Q71797619
Q2088182
Q93884
Q19952590
Q13073796
Q3504657
Q57842836
Q1142197
Q72802977
Q4193029

Q126178688
Q126484797
Q15647814
Q3683749
Q24574745
Q19648608
Q47524402
Q71533077
Q22247630
Q56428020
Q24571879
Q24571886
Q30432511
Q104637420
Q65932995
Q18720640
Q56005592
Q14204246
Q84597428
Q20726407
Q28858528
Q29075121
Q40218570
Q21504947
Q23841351
Q16222597
Q115317546
Q21281405
Q27949687
Q96707234
Q4167410
Q20769287
Q17146139
Q17362920
Q5296
Q4167836
Q15407973
Q15184295
Q59259626
Q11753321
Q22808320
Q36330215
Q35250433
Q59541917
Q11266439
Q19887878
Q20769160
Q21528878
Q17442446
Q14360432
Q4387047
Q16059585
Q25051296
Q21278897
Q27949697
Q21286738
Q17437796
Q29075123
Q17506997
Q17580674
Q51759403
Q17437798
Q21450877
Q96286657
Q24731821
Q48552277
Q105653689
Q65181907
Q122766472
Q33522042
Q99264677
Q15145755
Q110597964
Q20816977
Q16905922
Q55648788
Q21830861
Q16059624
Q54718960
Q116690561
Q107563839
Q115666147
Q96726072
Q114746893
Q44292661
Q74842049
Q74980542
Q121306412
Q123471651
Q54085024
Q21623879
Q26267864
Q107302455
Q106575300
Q106574913
Q106612246
Q124372134
Q111803808
Q21479588
Q97950663
Q26142649
Q110010043
Q108783631
Q97303168
Q111019629
Q108091160
Q116313869
Q28092864
Q56876519
Q23841178
Q114785468
Q95691391
Q107344376
Q98545791
Q63090714
Q87879655
Q21469493
Q114901426
Q108292642
Q97303176
Q112869585
Q97011660
Q116152754
Q116152698
Q66480449
Q87358148
Q15671253
Q11002482
Q12096573
Q125168941
Q29057009
Q88686174
Q122832588
Q100154329
Q16059613
Q25054829
Q19208935
Q9732903
Q28368760
Q97498045
Q28373483
Q65181871
Q47382471
Q6540326
Q54662266
Q115707333
Q104435523
Q58573615
Q115615343
Q18711811
Q61996773
Q52147067
Q115493615
Q65181814
Q116173022
Q115595777
Q97303167
Q105528595
Q102333788
Q116173030

Q10686088
Q10751567
Q108070570
Q10856912
Q115058632
Q11754706
Q11774975
Q11787635
Q118133244
Q11879316
Q11921612
Q11921615
Q12018895
Q12047490
Q12057009
Q126173083
Q12826957
Q13631891
Q14509400
Q16533216
Q18406422
Q20057026
Q21532062
Q2155543
Q2189621
Q2190497
Q2367316
Q24929620
Q25387115
Q2775436
Q2944157
Q3067379
Q3073171
Q30900226
Q3391551
Q3543185
Q3589441
Q4053676
Q42109388
Q49790789
Q5856748
Q9260892
Q9361550
Q96139666
Q97378680
Q106234336
Q123457601
Q17117792
Q379839
Q21398347
Q387728
Q1231925
Q1526622
Q123219881
Q110311628
Q17748590
Q570597
Q3067377
Q15731356
Q2615884
Q7432
Q706920
Q4811382
Q5290234
Q107411
Q169480
Q383654
Q790948
Q95576998
Q2229726
Q810559
Q176656
Q818769
Q21296992
Q426850
Q1972080
Q20898395
Q4940842
Q15549069
Q2415119
Q897314
Q2366573
Q8079180
Q2441534
Q857968
Q84963348
Q2623898
Q114226699
Q112260740
Q2922396
Q1062927
Q7329
Q281721
Q1088349
Q2601500
Q15596348
Q27997450
Q37766
Q15434329
Q117742550
Q17247777
Q4886
Q21160573
Q235799
Q9655063
Q1224358
Q106143312
Q1269532
Q55703935
Q17139017
Q3319256
Q7801533
Q2293576
Q104021
Q511044
Q826274
Q2708513
Q734957
Q1398497
Q123863041
Q2915904
Q1426199
Q1353106
Q104415882
Q4199393
Q25094606
Q4763620
Q3020028
Q759721
Q117101722
Q5704900
Q16641509
Q21231778
Q10590051
Q1613881
Q21370843
Q17484780
Q39367
Q2150520
Q123470712
Q2089056
Q42621
Q27554370
Q4362290
Q15304943
Q113015256
Q115227428
Q112082101
Q2568288
Q1656405
Q2737317
Q15552420
Q17024234
Q17023069
Q9293762
Q20011823
Q12045584
Q16682342
Q1734883
Q43577
Q11553410
Q713623
Q23058136
Q1462809
Q21398332
Q376887
Q174030
Q107214894
Q10555282
Q763978
Q1557956
Q2355817
Q39715265
Q1682991
Q107171772
Q11763592
Q6648557
Q27997762
Q1331042
Q2006883
Q94459438
Q1471119
Q3842173
Q41782262
Q27068180
Q40539673
Q110529959
Q730371
Q1296600
Q1577914
Q38945
Q38608
Q210958
Q1420193
Q2780704
Q65115395
Q4499913
Q17416587
Q1225065
Q1065449
Q38884
Q2002235
Q1306176
Q59779184
Q10340629
Q59278506
Q2612572
Q55983715
Q1915137
Q114689803
Q30456678
Q5562316
Q208755
Q15296664
Q1160573
Q63481286
Q15840335
Q115606891
Q66842775
Q122656757
Q927054
Q42693
Q107353801
Q107281982
Q12023547
Q21370415
Q17234779
Q4890197
Q932165
Q109311012
Q19877442
Q918036
Q38829
Q958314
Q21370511
Q2148210
Q12045585
Q281325
Q3941274
Q26817508
Q119408860
Q42670
Q15622363
Q2021626
Q3044032
Q18786396
Q2083941
Q2303193
Q1475739
Q1363241
Q96372729
Q27556670
Q855769
Q15623639
Q42295
Q107996468
Q19862317
Q5503135
Q15623573
Q16521
Q2379491
Q15567765
Q252730
Q17024649
Q22287012
Q68947
Q17216
Q2501204
Q108945737
Q104450895
Q667083
Q106453702
Q106453759
Q21370885
Q21370883
Q18420531
Q1609437
Q1185481
Q962530
Q25326
Q23728767
Q1755881
Q169518
Q21014462
Q40592296
Q15622387
Q198943
Q199072
Q3741757
Q186657
Q232984
Q53779045
Q244190
Q112683418
Q244769
Q21398653
Q237350
Q98961713
Q109813261
Q10282035
Q16197023
Q23038290
Q21521438
Q96377276
Q104795308
Q5961273
Q110811351
Q310890
Q47487597
Q27652812
Q58051350
Q310891
Q27555384
Q105758262
Q296519
Q393179
Q187419
Q68153243
Q21082470
Q101545971
Q21083189
Q21083222
Q5438231
Q19595924
Q4808129
Q2591752
Q18416333
Q116510307
Q21153294
Q21155244
Q4998607
Q105829350
Q116142583
Q30916786
Q1869705
Q21155533
Q39173095
Q56454446
Q21156641
Q21157076
Q21159245
Q5190924
Q21159579
Q5200515
Q3750886
Q1472531
Q21163125
Q16191265
Q6105176
Q5438221
Q87590412
Q21389852
Q21168750
Q21169101
Q21169444
Q21169746
Q5975385
Q21170208
Q21170220
Q3157059
Q12031876
Q21176094
Q108555862
Q6725546
Q125896870
Q6745764
Q116189027
Q21492265
Q21492266
Q108555443
Q108555196
Q27997887
Q71184245
Q3740029
Q7168511
Q109121061
Q4429366
Q12031877
Q27997240
Q1237403
Q3327587
Q7303476
Q7314350
Q109122697
Q18646936
Q109911257
Q7554935
Q16077723
Q13542797
Q7901171
Q25503075
Q8001433
Q2395880
Q8073782
Q2486530
Q11282089
Q118402781
Q38149
Q107391611
Q116742203
Q124056517
Q122890295
Q69897544
Q104524234
Q1849414
Q379061
Q2033233
Q4915935
Q4916097
Q17153089
Q2922293
Q3736622
Q108571085
Q107102664
Q107103129
Q106867847
Q5074411
Q110526701
Q5122907
Q117304857
Q124101869
Q107303655
Q27653145
Q27971671
Q122227691
Q97312312
Q100911412
Q32856057
Q14094102
Q15074003
Q110536225
Q50318633
Q108111735
Q1911718
Q27627225
Q20440835
Q5963564
Q18752025
Q4481514
Q3596094
Q17064903
Q3067386
Q5438191
Q19597237
Q5438193
Q1987683
Q5438194
Q2499322
Q5438196
Q5438201
Q3502871
Q5438202
Q5438198
Q17632086
Q2477555
Q2091229
Q2075785
Q3740284
Q124566462
Q5438205
Q16153424
Q60793324
Q5438210
Q5438212
Q124407232
Q18324596
Q13380988
Q5646558
Q5438214
Q5438217
Q5438219
Q5438218
Q10280306
Q3621843
Q5438229
Q2493235
Q5438234
Q83393031
Q27671617
Q3152018
Q27890445
Q1090520
Q110535774
Q72087654
Q18652270
Q106632695
Q59453852
Q5591854
Q30132039
Q5700975
Q56242815
Q105989956
Q27555050
Q3629905
Q115818534
Q1464706
Q114247248
Q121843395
Q121783826
Q931051
Q124307353
Q124158448
Q117411577
Q30751703
Q124056345
Q113427748
Q18405413
Q117411581
Q112159136
Q16877248
Q116193823
Q17198542
Q111211810
Q105989962
Q112305842
Q64159621
Q110533142
Q110534569
Q125838324
Q125838332
Q125838338
Q106207564
Q7169153
Q104879943
Q12042236
Q106686983
Q1320143
Q24036271
Q3503448
Q64159332
Q49661826
Q123460038
Q27555319
Q110586937
Q55448359
Q27671698
Q123492502
Q124526755
Q111611096
Q49621791
Q125926723
Q10378000
Q113298331
Q124477390
Q27653701
Q109122706
Q125799687
Q110529992
Q64149240
Q7883954
Q107059450
Q107143124
Q11900650
Q87756246
Q1386379
Q110532675
Q110520367
Q8001434
Q8001440
Q16635915
Q11268639

Q1046522
Q2870929
Q757702
Q898623
Q420439
Q67015883
Q581334
Q407569
Q55640599
Q15711994
Q84467700
Q59199015
Q124833429
Q56256173
Q56256178
Q1779868
Q3836750
Q1761300
Q12089225
Q3435660
Q380005
Q23804989
Q2103071
Q24205147
Q417841
Q7251477
Q860947
Q216830
Q1754612
Q17339814
Q47154513
Q2412859
Q56241591
Q2585617
Q741844
Q595306
Q27140058
Q27140060
Q27140061
Q27140067
Q2468605
Q5137424
Q4357608
Q5137434
Q5263670
Q120487796
Q27159102
Q126415415
Q96409943
Q4675133
Q4721889
Q4748440
Q4774187
Q3065655
Q16274732
Q76541752
Q4968132
Q100434640
Q5134879
Q84590794
Q116798516
Q50429939
Q97172349
Q61963483
Q28209424
Q17651887
Q16992915
Q102221646
Q12425065
Q55662456
Q98119151
Q6004128
Q74892521
Q122417763
Q6495092
Q4019783
Q6822155
Q78191131
Q122182140
Q13026783
Q4924638
Q55499636
Q46220684
Q60224961
Q60297128
Q7197337
Q7226545
Q7842200
Q27265911
Q27258839
Q123916137
Q122863107
Q66366032
Q7706206
