[{
    "icon": "fas fa-code",
    "title": "Web Development",
    "description": "It was popularised in the 1960s with the release of Letraset sheets containing Lorem Ipsum passages"
},
{
    "icon": "fas fa-mobile",
    "title": "Mobile Development",
    "description": "Various versions have evolved over the years, sometimes by accident, sometimes on purpose (injected humour and the like)."
},
{
    "icon": "fas fa-database",
    "title": "Databases",
    "description": "There are many variations of passages of Lorem Ipsum available, but the majority have suffered alteration in some form."
}]