{
  "userApiUrl": "${USER_API_URL}",
  "serverApiUrl": "${SERVER_API_URL}",
  "logApiUrl": "${LOG_API_URL}",
  "playersSkinApiUrl": "${PLAYERS_SKIN_API_URL}",
  "metricsApiUrl": "${METRICS_API_URL}",
  "predictionApiUrl": "${PREDICTION_API_URL}"
}
