// Jest Snapshot v1, https://goo.gl/fbAQLP

exports[`Boost renders a boost 1`] = `
<div>
  <div
    class="flex flex-col h-full w-full"
  >
    <div
      class="flex items-center w-full  h-[50%] h-lg:h-[30%]"
      data-testid="boost-header-container"
    >
      <div
        class="relative w-full h-full max-h-[300px] sm:max-h-[500px] bg-black-always"
      >
        <img
          alt="Advertised image"
          class="object-cover h-md:object-contain"
          data-nimg="fill"
          data-testid="boost-header-image"
          decoding="async"
          fetchpriority="high"
          src="https://cdn.minds.com/api/v2/media/proxy?size=800&src=https%3A%2F%2Fwww.minds.com%2Fstatic%2Fen%2Fassets%2Flogos%2Fbulb.svg"
          style="position: absolute; height: 100%; width: 100%; left: 0px; top: 0px; right: 0px; bottom: 0px; color: transparent;"
        />
      </div>
    </div>
    <div
      class="flex-1 overflow-auto mt-[12px] px-[16px] mb-0 h-md:mb-[8px]"
      data-testid="boost-body-container"
    >
      <h1
        class="text-lg text-primary font-bold mb-[12px]"
        data-testid="boost-body-title"
      >
        This is a title
      </h1>
      <p
        class="text-md text-primary break-words"
        data-testid="boost-body-message"
      >
        This is a message
      </p>
    </div>
    <div
      class="viewport-sm:block hidden"
    >
      <div
        class="mx-[16px] h-lg:my-[16px] my-[8px] min-h-[36px]"
      >
        <button
          class="bg-action text-primary-inverted w-full font-bold py-[6px] px-[38px] rounded-[99px] hover:brightness-90 active:brightness-[0.8]"
          data-testid="boost-footer-cta"
        >
          Sign up
        </button>
      </div>
    </div>
  </div>
</div>
`;

exports[`Boost renders a boost without an image 1`] = `
<div>
  <div
    class="flex flex-col h-full w-full"
  >
    <div
      class="flex-1 overflow-auto mt-[12px] px-[16px] mb-0 h-md:mb-[8px]"
      data-testid="boost-body-container"
    >
      <h1
        class="text-lg text-primary font-bold mb-[12px]"
        data-testid="boost-body-title"
      >
        This is a title
      </h1>
      <p
        class="text-md text-primary break-words"
        data-testid="boost-body-message"
      >
        This is a message
      </p>
    </div>
    <div
      class="viewport-sm:block hidden"
    >
      <div
        class="mx-[16px] h-lg:my-[16px] my-[8px] min-h-[36px]"
      >
        <button
          class="bg-action text-primary-inverted w-full font-bold py-[6px] px-[38px] rounded-[99px] hover:brightness-90 active:brightness-[0.8]"
          data-testid="boost-footer-cta"
        >
          Sign up
        </button>
      </div>
    </div>
  </div>
</div>
`;

exports[`Boost renders without CTA when boost has no goal button text 1`] = `
<div>
  <div
    class="flex flex-col h-full w-full"
  >
    <div
      class="flex items-center w-full  h-[50%] h-lg:h-[30%]"
      data-testid="boost-header-container"
    >
      <div
        class="relative w-full h-full max-h-[300px] sm:max-h-[500px] bg-black-always"
      >
        <img
          alt="Advertised image"
          class="object-cover h-md:object-contain"
          data-nimg="fill"
          data-testid="boost-header-image"
          decoding="async"
          fetchpriority="high"
          src="https://cdn.minds.com/api/v2/media/proxy?size=800&src=https%3A%2F%2Fwww.minds.com%2Fstatic%2Fen%2Fassets%2Flogos%2Fbulb.svg"
          style="position: absolute; height: 100%; width: 100%; left: 0px; top: 0px; right: 0px; bottom: 0px; color: transparent;"
        />
      </div>
    </div>
    <div
      class="flex-1 overflow-auto mt-[12px] px-[16px] mb-0 h-md:mb-[8px]"
      data-testid="boost-body-container"
    >
      <h1
        class="text-lg text-primary font-bold mb-[12px]"
        data-testid="boost-body-title"
      >
        This is a title
      </h1>
      <p
        class="text-md text-primary break-words"
        data-testid="boost-body-message"
      >
        This is a message
      </p>
    </div>
  </div>
</div>
`;
