{
  "kind": "collectionType",
  "collectionName": "value_prop_cards",
  "info": {
    "singularName": "value-prop-card",
    "pluralName": "value-prop-cards",
    "displayName": "Value Prop Card",
    "description": ""
  },
  "options": {
    "draftAndPublish": true
  },
  "pluginOptions": {
    "i18n": {
      "localized": true
    }
  },
  "attributes": {
    "title": {
      "pluginOptions": {
        "i18n": {
          "localized": true
        }
      },
      "type": "string",
      "required": true
    },
    "media": {
      "type": "media",
      "multiple": false,
      "required": true,
      "allowedTypes": [
        "images",
        "videos"
      ],
      "pluginOptions": {
        "i18n": {
          "localized": false
        }
      }
    },
    "order": {
      "pluginOptions": {
        "i18n": {
          "localized": true
        }
      },
      "type": "decimal",
      "unique": true,
      "min": 0
    }
  }
}
