{
  "collectionName": "components_onboarding_v5_onboarding_steps",
  "info": {
    "displayName": "Onboarding Step",
    "description": ""
  },
  "options": {},
  "attributes": {
    "carousel": {
      "type": "component",
      "repeatable": true,
      "component": "onboarding-v5.carousel-item",
      "required": true
    },
    "title": {
      "type": "string",
      "required": true
    },
    "description": {
      "type": "string",
      "required": true
    },
    "stepType": {
      "type": "enumeration",
      "enum": [
        "verify_email",
        "tag_selector",
        "survey",
        "user_selector",
        "group_selector"
      ],
      "required": true
    },
    "stepKey": {
      "type": "string",
      "required": true
    },
    "verifyEmailForm": {
      "type": "component",
      "repeatable": false,
      "component": "onboarding-v5.verify-email-step"
    },
    "tagSelector": {
      "type": "component",
      "repeatable": false,
      "component": "onboarding-v5.tag-selector-step"
    },
    "radioSurveyQuestion": {
      "type": "string"
    },
    "radioSurvey": {
      "type": "component",
      "repeatable": true,
      "component": "onboarding-v5.radio-option",
      "min": 2
    },
    "userSelector": {
      "type": "component",
      "repeatable": false,
      "component": "onboarding-v5.user-selector-step"
    },
    "groupSelector": {
      "type": "component",
      "repeatable": false,
      "component": "onboarding-v5.group-selector-step"
    },
    "actionButton": {
      "type": "component",
      "repeatable": false,
      "component": "onboarding-v5.action-button"
    },
    "skipButton": {
      "type": "component",
      "repeatable": false,
      "component": "onboarding-v5.skip-button"
    }
  }
}
