{
  "kind": "collectionType",
  "collectionName": "product_features",
  "info": {
    "singularName": "product-feature",
    "pluralName": "product-features",
    "displayName": "Product Feature",
    "description": ""
  },
  "options": {
    "draftAndPublish": true
  },
  "pluginOptions": {},
  "attributes": {
    "featureName": {
      "type": "string",
      "minLength": 2,
      "required": true
    },
    "explainerText": {
      "type": "string"
    }
  }
}
