{
  "collectionName": "components_v2-product_action_buttons",
  "info": {
    "displayName": "ActionButton",
    "description": ""
  },
  "options": {},
  "attributes": {
    "text": {
      "type": "string",
      "required": true,
      "minLength": 2
    },
    "action": {
      "type": "enumeration",
      "enum": [
        "open_composer",
        "open_uniswap_v2_liquidity",
        "open_onchain_transfer_modal",
        "scroll_to_top",
        "open_register_modal",
        "open_plus_upgrade_modal",
        "open_pro_upgrade_modal",
        "networks_team_checkout",
        "networks_community_checkout",
        "networks_enterprise_checkout",
        "networks_start_trial"
      ]
    },
    "navigationUrl": {
      "type": "string"
    },
    "dataRef": {
      "type": "string"
    },
    "solid": {
      "type": "boolean"
    },
    "rounded": {
      "type": "boolean"
    },
    "stripeProductKey": {
      "type": "string"
    },
    "trialUpgradeRequest": {
      "type": "boolean",
      "default": false
    }
  }
}
