{
  "collectionName": "components_onboarding_v5_carousel_items",
  "info": {
    "displayName": "Carousel Item"
  },
  "options": {},
  "attributes": {
    "title": {
      "type": "string",
      "required": true
    },
    "media": {
      "allowedTypes": [
        "images"
      ],
      "type": "media",
      "multiple": false,
      "required": true
    }
  }
}
