{
  "collectionName": "components_v2-product_basic_explainers",
  "info": {
    "displayName": "Basic Explainer",
    "description": ""
  },
  "options": {},
  "attributes": {
    "title": {
      "type": "string",
      "required": true,
      "minLength": 3
    },
    "body": {
      "type": "richtext",
      "minLength": 3,
      "required": true
    },
    "button": {
      "type": "component",
      "repeatable": false,
      "component": "v2-product.action-button"
    }
  }
}
