{
  "kind": "collectionType",
  "collectionName": "onboarding_v5_versions",
  "info": {
    "singularName": "onboarding-v5-version",
    "pluralName": "onboarding-v5-versions",
    "displayName": "Onboarding V5 Version",
    "description": ""
  },
  "options": {
    "draftAndPublish": true
  },
  "pluginOptions": {},
  "attributes": {
    "steps": {
      "type": "dynamiczone",
      "components": [
        "onboarding-v5.onboarding-step"
      ],
      "required": true
    },
    "completionStep": {
      "type": "component",
      "repeatable": false,
      "component": "onboarding-v5.completion-step",
      "required": true
    }
  }
}
