{
  "kind": "collectionType",
  "collectionName": "feat_table_columns",
  "info": {
    "singularName": "feat-table-column",
    "pluralName": "feat-table-columns",
    "displayName": "Feat Table Column",
    "description": ""
  },
  "options": {
    "draftAndPublish": true
  },
  "pluginOptions": {},
  "attributes": {
    "featTableHeader": {
      "displayName": "Feature Table Header",
      "type": "component",
      "repeatable": false,
      "component": "v2-product.feature-table-header"
    },
    "sections": {
      "type": "relation",
      "relation": "oneToMany",
      "target": "api::feat-table-section.feat-table-section"
    },
    "tier": {
      "type": "enumeration",
      "enum": [
        "free",
        "plus",
        "pro",
        "networks",
        "networks_team",
        "networks_community",
        "networks_enterprise",
        "networks_on_prem",
        "self_hosted"
      ]
    }
  }
}
