{
  "collectionName": "components_v2-product_feature_tables",
  "info": {
    "displayName": "Feature Table",
    "description": ""
  },
  "options": {},
  "attributes": {
    "title": {
      "type": "string",
      "minLength": 3,
      "required": true
    },
    "subtitle": {
      "type": "string",
      "required": true,
      "minLength": 3
    },
    "columns": {
      "type": "relation",
      "relation": "oneToMany",
      "target": "api::feat-table-column.feat-table-column"
    }
  }
}
