{
  "kind": "collectionType",
  "collectionName": "product_add_ons",
  "info": {
    "singularName": "product-add-on",
    "pluralName": "product-add-ons",
    "displayName": "Product Add-on",
    "description": ""
  },
  "options": {
    "draftAndPublish": true
  },
  "pluginOptions": {},
  "attributes": {
    "key": {
      "type": "enumeration",
      "enum": [
        "mobile_app",
        "technical_support",
        "moderation",
        "mobile_app_setup"
      ]
    },
    "name": {
      "type": "string",
      "required": true,
      "minLength": 1
    },
    "description": {
      "type": "string",
      "required": true,
      "minLength": 1
    },
    "perksTitle": {
      "type": "string",
      "required": true,
      "minLength": 1,
      "default": "Features"
    },
    "perks": {
      "type": "component",
      "repeatable": true,
      "component": "v2-product.perk",
      "required": false
    }
  }
}
