{
  "collectionName": "components_onboarding_v5_tag_selector_steps",
  "info": {
    "displayName": "Tag Selector",
    "description": ""
  },
  "options": {},
  "attributes": {
    "customTagInputText": {
      "type": "string",
      "required": true,
      "default": "Didn’t find what you were looking for? Add a custom tag"
    }
  }
}
