{
  "kind": "collectionType",
  "collectionName": "feat_table_sections",
  "info": {
    "singularName": "feat-table-section",
    "pluralName": "feat-table-sections",
    "displayName": "Feat Table Section",
    "description": ""
  },
  "options": {
    "draftAndPublish": true
  },
  "pluginOptions": {},
  "attributes": {
    "headerText": {
      "type": "string",
      "required": true,
      "minLength": 2
    },
    "items": {
      "type": "relation",
      "relation": "oneToMany",
      "target": "api::feat-table-item.feat-table-item"
    },
    "description": {
      "type": "string",
      "required": true,
      "private": true,
      "minLength": 2
    }
  }
}
