{
  "kind": "singleType",
  "collectionName": "topbar_alerts",
  "info": {
    "singularName": "topbar-alert",
    "pluralName": "topbar-alerts",
    "displayName": "TopbarAlert",
    "description": ""
  },
  "options": {
    "draftAndPublish": true
  },
  "pluginOptions": {},
  "attributes": {
    "enabled": {
      "type": "boolean",
      "required": true
    },
    "url": {
      "type": "string"
    },
    "identifier": {
      "type": "string",
      "required": true
    },
    "message": {
      "type": "richtext",
      "required": true
    },
    "onlyDisplayAfter": {
      "type": "datetime",
      "default": "2023-04-30T23:00:00.000Z",
      "required": true
    }
  }
}
