{
  "collectionName": "components_onboarding_v5_verify_email_steps",
  "info": {
    "displayName": "Verify Email Form",
    "description": ""
  },
  "options": {},
  "attributes": {
    "inputLabel": {
      "type": "string",
      "required": true,
      "default": "Verification code"
    },
    "inputPlaceholder": {
      "type": "string"
    },
    "resendCodeText": {
      "type": "string",
      "default": "Didn’t get a code? Check your spam folder, or {action}.",
      "regex": "{action}",
      "required": true
    },
    "resendCodeActionText": {
      "type": "string",
      "required": true,
      "minLength": 2,
      "default": "resend code"
    },
    "changeEmailActionText": {
      "type": "string",
      "required": true,
      "default": "Change email address",
      "minLength": 3
    },
    "changeEmailTitle": {
      "type": "string",
      "required": true,
      "default": "Change email address",
      "minLength": 3
    },
    "changeEmailDescription": {
      "type": "string",
      "required": true,
      "default": "Mistyped your email? Change your email address below.",
      "minLength": 3
    },
    "changeEmailInputLabel": {
      "type": "string",
      "required": true,
      "minLength": 3
    },
    "changeEmailInputPlaceholder": {
      "type": "string"
    },
    "changeEmailActionButton": {
      "type": "component",
      "repeatable": false,
      "component": "onboarding-v5.action-button",
      "required": true
    }
  }
}
