module gitlab.com/mind-framework/asterisk/goami

go 1.12

require (
	github.com/davecgh/go-spew v1.1.0 // indirect
	github.com/facebookgo/ensure v0.0.0-20160127193407-b4ab57deab51
	github.com/facebookgo/stack v0.0.0-20160209184415-751773369052 // indirect
	github.com/facebookgo/subset v0.0.0-20150612182917-8dac2c3c4870 // indirect
)
