[
	{
		"nmenomic": "type",
		"label": "Tipo",
		"values": ["friend","peer"],
		"description": "Tipo de Peer SIP"
	},
	{
		"nmenomic": "host",
		"label": "Host",
		"description": "IP del destino"
	},
	{
		"nmenomic": "secret",
		"label": "Contraseña",
		"description": "Contraseña para autenticación"
	},
	{
		"nmenomic": "allow",
		"label": "Permitir Codec",
		"values": ["all","alaw","ulaw"],
		"description": "Codec Permitido"
	},
	{
		"nmenomic": "deny",
		"label": "Denegar Codec",
		"values": ["all","alaw","ulaw"],
		"description": "Codec Denegado"
	}

]