{
  "version": "2017-02-28",
  "operation": "Invoke",
  "payload": {
    "field": "getCurrentWeather",
    "arguments": $utils.toJson($context.arguments),
    "handle": $utils.toJson($context.identity.username)
  }
}
