{
    "name": "Street",
    "fields": [
        {
            "fieldName": "name",
            "fieldType": "String"
        }
    ],
    "relationships": [],
    "changelogDate": "20190611000341",
    "entityTableName": "street",
    "dto": "mapstruct",
    "pagination": "pager",
    "service": "serviceClass",
    "jpaMetamodelFiltering": false,
    "fluentMethods": true,
    "clientRootFolder": "",
    "applications": "*"
}