id;name;type
1;akacja;zapach
2;aloes;zapach
3;anyż;zapach
4;argan;zapach
5;awokado;zapach
6;bergamotka;zapach
7;bez;zapach
8;bławatek;zapach
9;brzoskwinia;zapach
10;cedr;zapach
11;cynamon;zapach
12;cytryna;zapach
13;czekolada;zapach
14;drzewo herbaciane;zapach
15;ekstrakt z miłorzębu;zapach
16;eukaliptus;zapach
17;fiołek;zapach
18;frezja;zapach
19;golteria;zapach
20;goździk;zapach
21;grapefruit;zapach
22;hydrolat z czystka;zapach
23;jabłko;zapach
24;jaśmin;zapach
25;kamfora;zapach
26;kawa;zapach
27;kokos;zapach
28;konwalia;zapach
29;kwiat bławatka;płatki kwiatów
30;lawenda;zapach
31;lemongras;zapach
32;limetka;zapach
33;litsea Cubeba;zapach
34;magnolia;zapach
35;mandarynka;zapach
36;mango;zapach
37;mięta;zapach
38;naouli;zapach
39;niaouli;zapach
40;opium;zapach
41;paczula;zapach
42;piwonia;zapach
43;piżmo;zapach
44;płatki nagietka;płatki kwiatów
45;płatki róży czerwonej;płatki kwiatów
46;płatki słonecznika;płatki kwiatów
47;pomarańcza;zapach
48;pomelo;zapach
49;róża;zapach
50;rozmaryn;zapach
51;sandał;zapach
52;sól himalajska;sypkie
53;sól z Morza Martwego;sypkie
54;susz lawendy;płatki kwiatów
55;szałwia;zapach
56;truskawka;zapach
57;tymianek;zapach
58;wanilia;zapach
59;wiśnia;zapach
60;ziarna kawy;sypkie
61;zielona herbata;zapach
62;truskawka;zapach
