Version = 2.0
File Name = D:/RB_ARIS_Files/ARIS_2019_07_05/Porcupine_RB_2019-07-05_080000.aris
Total Number Of Marks = 2
Total Time = 29.967 minutes
Date = 07/05/2019
Start Time = 01:00:18

Sample	Ping	Time	Range	Amplitude	XAngle	YAngle	Direction	Length	Area	Operator
518	14399	21.485	 10.75	-33.073	-1.46	 0.00	0.000	 0.609	  0.00	LNN
529	14400	21.487	 10.92	-22.925	 0.60	 0.00	1.000	 0.000	  0.00	LNN
