Version = 2.0
File Name = Z:/RB_ARIS_Files/ARIS_2019_07_02/Porcupine_RB_2019-07-02_160000.aris
Total Number Of Marks = 1
Total Time = 29.983 minutes
Date = 07/02/2019
Start Time = 09:00:08

Sample	Ping	Time	Range	Amplitude	XAngle	YAngle	Direction	Length	Area	Operator
193	7798	11.771	  5.26	-12.477	-0.60	 0.00	1.000	 0.000	  0.00	LNN
