Version = 2.0
File Name = D:/RB_ARIS_Files/ARIS_2019_07_06/Porcupine_RB_2019-07-06_123000.aris
Total Number Of Marks = 0
Total Time = 9.200 minutes
Date = 07/06/2019
Start Time = 05:30:01

Sample	Ping	Time	Range	Amplitude	XAngle	YAngle	Direction	Length	Area	Operator
