Version = 2.0
File Name = Z:/RB_ARIS_Files/ARIS_2019_07_04/Porcupine_RB_2019-07-04_203000.aris
Total Number Of Marks = 2
Total Time = 29.983 minutes
Date = 07/04/2019
Start Time = 13:30:16

Sample	Ping	Time	Range	Amplitude	XAngle	YAngle	Direction	Length	Area	Operator
36	258	 0.740	 20.85	-9.739	-0.45	 0.00	0.000	 0.721	  0.00	KJW
42	253	 0.726	 20.98	-5.038	 0.00	 0.00	1.000	 0.000	  0.00	KJW
