Version = 2.0
File Name = D:/RB_ARIS_Files/ARIS_2019_07_06/Porcupine_RB_2019-07-06_090000.aris
Total Number Of Marks = 2
Total Time = 27.050 minutes
Date = 07/06/2019
Start Time = 02:00:02

Sample	Ping	Time	Range	Amplitude	XAngle	YAngle	Direction	Length	Area	Operator
587	2080	 4.633	 15.03	-29.578	 1.82	 0.00	0.000	 0.619	  0.00	KJW
580	2080	 4.633	 14.87	-17.391	 0.00	 0.00	1.000	 0.000	  0.00	KJW
