Version = 2.0
File Name = D:/RB_ARIS_Files/ARIS_2019_07_06/Porcupine_RB_2019-07-06_000000.aris
Total Number Of Marks = 2
Total Time = 29.967 minutes
Date = 07/05/2019
Start Time = 17:00:01

Sample	Ping	Time	Range	Amplitude	XAngle	YAngle	Direction	Length	Area	Operator
224	13034	27.881	  7.02	-35.680	-1.32	 0.00	0.000	 0.654	  0.00	KJW
230	13025	27.862	  7.15	-41.078	-4.80	 0.00	-1.000	 0.000	  0.00	KJW
