Version = 2.0
File Name = Z:/RB_ARIS_Files/ARIS_2019_07_02/Porcupine_RB_2019-07-02_153000.aris
Total Number Of Marks = 1
Total Time = 29.967 minutes
Date = 07/02/2019
Start Time = 08:30:08

Sample	Ping	Time	Range	Amplitude	XAngle	YAngle	Direction	Length	Area	Operator
559	7622	21.495	 32.39	-13.328	 0.00	 0.00	1.000	 0.000	  0.00	LNN
