Version = 2.0
File Name = Y:/LB_ARIS_Files/ARIS_2019_07_07/Porcupine_LB_2019-07-07_100031.aris
Total Number Of Marks = 0
Total Time = 29.467 minutes
Date = 07/07/2019
Start Time = 03:00:31

Sample	Ping	Time	Range	Amplitude	XAngle	YAngle	Direction	Length	Area	Operator
