Version = 2.0
File Name = Y:/LB_ARIS_Files/ARIS_2019_07_06/Porcupine_LB_2019-07-06_100000.aris
Total Number Of Marks = 0
Total Time = 29.983 minutes
Date = 07/06/2019
Start Time = 03:00:00

Sample	Ping	Time	Range	Amplitude	XAngle	YAngle	Direction	Length	Area	Operator
