Version = 2.0
File Name = D:/RB_ARIS_Files/ARIS_2019_07_06/Porcupine_RB_2019-07-06_230000.aris
Total Number Of Marks = 2
Total Time = 29.967 minutes
Date = 07/06/2019
Start Time = 16:00:02

Sample	Ping	Time	Range	Amplitude	XAngle	YAngle	Direction	Length	Area	Operator
670	20255	28.488	 16.92	-31.281	 1.71	 0.00	0.000	 0.638	  0.00	KJW
672	20246	28.476	 16.95	-24.117	 0.00	 0.00	1.000	 0.000	  0.00	KJW
