Version = 2.0
File Name = Y:/LB_ARIS_Files/ARIS_2019_07_04/Porcupine_LB_2019-07-04_220000.aris
Total Number Of Marks = 0
Total Time = 29.983 minutes
Date = 07/04/2019
Start Time = 15:00:00

Sample	Ping	Time	Range	Amplitude	XAngle	YAngle	Direction	Length	Area	Operator
