Version = 2.0
File Name = Z:/RB_ARIS_Files/ARIS_2019_06_28/Porcupine_RB_2019-06-28_100000.aris
Total Number Of Marks = 1
Total Time = 29.983 minutes
Date = 06/28/2019
Start Time = 03:00:04

Sample	Ping	Time	Range	Amplitude	XAngle	YAngle	Direction	Length	Area	Operator
1687	10281	27.602	  9.34	-22.376	-3.00	 0.00	1.000	 0.000	  0.00	KJW
