Version = 2.0
File Name = Z:/RB_ARIS_Files/ARIS_2019_06_27/Porcupine_RB_2019-06-27_220000.aris
Total Number Of Marks = 1
Total Time = 29.983 minutes
Date = 06/27/2019
Start Time = 15:00:02

Sample	Ping	Time	Range	Amplitude	XAngle	YAngle	Direction	Length	Area	Operator
2015	5533	14.694	 10.81	-12.321	-1.20	 0.00	1.000	 0.000	  0.00	KJW
