Version = 2.0
File Name = Y:/LB_ARIS_Files/ARIS_2019_07_07/Porcupine_LB_2019-07-07_070000.aris
Total Number Of Marks = 2
Total Time = 29.983 minutes
Date = 07/07/2019
Start Time = 00:00:02

Sample	Ping	Time	Range	Amplitude	XAngle	YAngle	Direction	Length	Area	Operator
40	7751	11.245	  2.96	14.406	 6.31	 0.00	0.000	 0.652	  0.00	LNN
43	7750	11.244	  3.01	-11.620	-2.40	 0.00	1.000	 0.000	  0.00	LNN
