Version = 2.0
File Name = Z:/RB_ARIS_Files/ARIS_2019_07_04/Porcupine_RB_2019-07-04_200000.aris
Total Number Of Marks = 0
Total Time = 29.983 minutes
Date = 07/04/2019
Start Time = 13:00:16

Sample	Ping	Time	Range	Amplitude	XAngle	YAngle	Direction	Length	Area	Operator
