Version = 2.0
File Name = Z:/RB_ARIS_Files/ARIS_2019_07_04/Porcupine_RB_2019-07-04_160000.aris
Total Number Of Marks = 2
Total Time = 29.983 minutes
Date = 07/04/2019
Start Time = 09:00:15

Sample	Ping	Time	Range	Amplitude	XAngle	YAngle	Direction	Length	Area	Operator
476	14849	22.198	 10.04	-28.057	 2.17	 0.00	0.000	 0.616	  0.00	KJW
463	14851	22.201	  9.81	-28.442	-0.60	 0.00	-1.000	 0.000	  0.00	KJW
