Version = 2.0
File Name = Y:/LB_ARIS_Files/ARIS_2019_07_05/Porcupine_LB_2019-07-05_150000.aris
Total Number Of Marks = 2
Total Time = 29.983 minutes
Date = 07/05/2019
Start Time = 08:00:02

Sample	Ping	Time	Range	Amplitude	XAngle	YAngle	Direction	Length	Area	Operator
121	8801	22.897	  4.76	 7.834	-4.11	 0.00	0.000	 0.651	  0.00	LNN
124	8801	22.897	  4.80	-4.001	 3.00	 0.00	1.000	 0.000	  0.00	LNN
