Version = 2.0
File Name = Z:/RB_ARIS_Files/ARIS_2019_07_02/Porcupine_RB_2019-07-02_013000.aris
Total Number Of Marks = 0
Total Time = 29.967 minutes
Date = 07/01/2019
Start Time = 18:30:06

Sample	Ping	Time	Range	Amplitude	XAngle	YAngle	Direction	Length	Area	Operator
