Version = 2.0
File Name = Z:/RB_ARIS_Files/ARIS_2019_07_01/Porcupine_RB_2019-07-01_013000.aris
Total Number Of Marks = 1
Total Time = 29.983 minutes
Date = 06/30/2019
Start Time = 18:30:02

Sample	Ping	Time	Range	Amplitude	XAngle	YAngle	Direction	Length	Area	Operator
155	6001	16.802	 23.46	-4.403	13.80	 0.00	1.000	 0.000	  0.00	KJW
