"","Date","LB.Estimate","RB.Estimate","Daily_Total","Cumulative_Total"
"1",2019-07-01,4,8,12,12
"2",2019-07-02,6,12,18,30
"3",2019-07-03,16,6,22,52
"4",2019-07-04,2,14,16,68
"5",2019-07-05,8,9,17,85
"6",2019-07-06,4,12,16,101
"7",2019-07-07,8,1,9,110
"8",2019-07-08,8,NA,8,118
"9",2019-06-27,NA,2,2,120
"10",2019-06-28,NA,4,4,124
"11",2019-06-29,NA,4,4,128
"12",2019-06-30,NA,9,9,137
