Version = 2.0
File Name = Z:/RB_ARIS_Files/ARIS_2019_07_04/Porcupine_RB_2019-07-04_233000.aris
Total Number Of Marks = 0
Total Time = 29.967 minutes
Date = 07/04/2019
Start Time = 16:30:17

Sample	Ping	Time	Range	Amplitude	XAngle	YAngle	Direction	Length	Area	Operator
