Version = 2.0
File Name = Z:/RB_ARIS_Files/ARIS_2019_07_04/Porcupine_RB_2019-07-04_213000.aris
Total Number Of Marks = 2
Total Time = 29.983 minutes
Date = 07/04/2019
Start Time = 14:30:16

Sample	Ping	Time	Range	Amplitude	XAngle	YAngle	Direction	Length	Area	Operator
108	2058	 5.904	 22.44	-21.492	-0.80	 0.00	0.000	 0.675	  0.00	KJW
117	2054	 5.892	 22.63	-4.003	 0.00	 0.00	-1.000	 0.000	  0.00	KJW
