Version = 2.0
File Name = Y:/LB_ARIS_Files/ARIS_2019_07_06/Porcupine_LB_2019-07-06_220000.aris
Total Number Of Marks = 2
Total Time = 29.983 minutes
Date = 07/06/2019
Start Time = 15:00:01

Sample	Ping	Time	Range	Amplitude	XAngle	YAngle	Direction	Length	Area	Operator
187	14288	20.623	  6.20	-12.061	-0.48	 0.00	0.000	 0.677	  0.00	KJW
188	14299	20.639	  6.22	-14.694	 3.60	 0.00	-1.000	 0.000	  0.00	KJW
