Version = 2.0
File Name = Y:/LB_ARIS_Files/ARIS_2019_07_06/Porcupine_LB_2019-07-06_123734.aris
Total Number Of Marks = 0
Total Time = 22.417 minutes
Date = 07/06/2019
Start Time = 05:37:34

Sample	Ping	Time	Range	Amplitude	XAngle	YAngle	Direction	Length	Area	Operator
