{
    "name": "python-opengl",
    "buildsystem": "simple",
    "build-commands": [
        "pip3 install --exists-action=i --no-index --find-links=\"file://${PWD}\" --prefix=${FLATPAK_DEST} \"PyOpenGL\" --no-build-isolation"
    ],
    "sources": [
        {
            "type": "file",
            "url": "https://files.pythonhosted.org/packages/b8/73/31c8177f3d236e9a5424f7267659c70ccea604dab0585bfcd55828397746/PyOpenGL-3.1.5.tar.gz",
            "sha256": "4107ba0d0390da5766a08c242cf0cf3404c377ed293c5f6d701e457c57ba3424",
            "x-checker-data": {
                "type": "pypi",
                "name": "PyOpenGL"
            }
        }
    ],
    "modules": [
        {
            "name": "freeglut",
            "buildsystem": "cmake",
            "build-options": {
                "cflags": "-fcommon"
            },
            "config-opts": [
                "-DFREEGLUT_BUILD_STATIC_LIBS=OFF",
                "-DFREEGLUT_BUILD_DEMOS=OFF",
                "-DCMAKE_BUILD_TYPE=None"
            ],
            "sources": [
                {
                    "type": "archive",
                    "url": "https://sourceforge.net/projects/freeglut/files/freeglut/3.2.1/freeglut-3.2.1.tar.gz",
                    "sha256": "d4000e02102acaf259998c870e25214739d1f16f67f99cb35e4f46841399da68",
                    "x-checker-data": {
                        "type": "anitya",
                        "project-id": 846,
                        "url-template": "https://sourceforge.net/projects/freeglut/files/freeglut/$version/freeglut-$version.tar.gz"
                    }
                },
		{
		    "type": "patch",
		    "path": "../../001_freeglut_cmakelists.patch"
		}
            ],
            "cleanup": [
                "/include",
                "/lib/cmake",
                "/lib/pkgconfig"
            ],
            "modules": [
                "../../shared-modules/glu/glu-9.json"
            ]
        }
    ]
}
