_____/\\\\\\\\\\\\____________/\\\_____/\\\\____________/\\\\______/\\\__/\\\\\_____/\\\_____/\\\\\\\\\\\\_        
 ___/\\\//////////___________/\\\\\____\/\\\\\\________/\\\\\\__/\\\\\\\_\/\\\\\\___\/\\\___/\\\//////////__       
  __/\\\____________________/\\\/\\\____\/\\\//\\\____/\\\//\\\_\/////\\\_\/\\\/\\\__\/\\\__/\\\_____________      
   _\/\\\____/\\\\\\\______/\\\/\/\\\____\/\\\\///\\\/\\\/_\/\\\_____\/\\\_\/\\\//\\\_\/\\\_\/\\\____/\\\\\\\_     
    _\/\\\___\/////\\\____/\\\/__\/\\\____\/\\\__\///\\\/___\/\\\_____\/\\\_\/\\\\//\\\\/\\\_\/\\\___\/////\\\_    
     _\/\\\_______\/\\\__/\\\\\\\\\\\\\\\\_\/\\\____\///_____\/\\\_____\/\\\_\/\\\_\//\\\/\\\_\/\\\_______\/\\\_   
      _\/\\\_______\/\\\_\///////////\\\//__\/\\\_____________\/\\\_____\/\\\_\/\\\__\//\\\\\\_\/\\\_______\/\\\_  
       _\//\\\\\\\\\\\\/____________\/\\\____\/\\\_____________\/\\\_____\/\\\_\/\\\___\//\\\\\_\//\\\\\\\\\\\\/__ 
        __\////////////______________\///_____\///______________\///______\///__\///_____\/////___\////////////____

