               __                  __                  _           
  ____ ___  __/ /_____  ___  _  __/ /____  ____  _____(_)___  ____ 
 / __ `/ / / / __/ __ \/ _ \| |/_/ __/ _ \/ __ \/ ___/ / __ \/ __ \
/ /_/ / /_/ / /_/ /_/ /  __/>  </ /_/  __/ / / (__  ) / /_/ / / / /
\__,_/\__,_/\__/\____/\___/_/|_|\__/\___/_/ /_/____/_/\____/_/ /_/ 
                                                                   