<svg width="25" height="28" viewBox="0 0 25 28" fill="none" xmlns="http://www.w3.org/2000/svg">
<g filter="url(#filter0_d_8908_374939)">
<path d="M13.366 19.5C12.9811 20.1667 12.0189 20.1667 11.634 19.5L4.27276 6.75C3.88786 6.08333 4.36898 5.25 5.13879 5.25L19.8612 5.25C20.631 5.25 21.1121 6.08333 20.7272 6.75L13.366 19.5Z" fill="#59D7E3"/>
<path fill-rule="evenodd" clip-rule="evenodd" d="M7.05455 6.90214C6.8234 6.50099 7.11293 6 7.57591 6H18.0809C18.2326 6 18.3727 6.0809 18.4486 6.21224C18.6122 6.49538 18.4079 6.84943 18.0809 6.84943L10.2718 6.84943C9.25119 6.84943 8.61448 7.95573 9.12723 8.83825L11.6903 13.2497C11.7666 13.381 11.7668 13.5431 11.6908 13.6746C11.5276 13.9572 11.1196 13.957 10.9567 13.6742L7.05455 6.90214ZM12.3513 16.9393C12.1195 17.3401 11.5409 17.3398 11.3094 16.9389L6.0569 7.84132C5.98106 7.70995 5.98103 7.54811 6.05683 7.41672C6.22025 7.13347 6.62902 7.13341 6.79253 7.4166L10.697 14.1794C11.2074 15.0633 12.4838 15.0616 12.9917 14.1763L15.5306 9.75086C15.6062 9.61912 15.7465 9.5379 15.8984 9.53795C16.2247 9.53805 16.4285 9.89149 16.2651 10.174L12.3513 16.9393ZM18.9185 8.23763C19.15 7.83668 18.8609 7.33544 18.3979 7.33505L10.5821 7.32835C10.2557 7.32807 10.0515 7.68126 10.2146 7.96393C10.2905 8.09548 10.431 8.17637 10.5829 8.17595L15.6848 8.16199C16.7055 8.15919 17.3452 9.26375 16.8349 10.1477L12.9304 16.9105C12.7669 17.1937 12.9713 17.5477 13.2983 17.5476C13.45 17.5475 13.5902 17.4666 13.666 17.3352L18.9185 8.23763Z" fill="#F5F7F9"/>
</g>
<defs>
<filter id="filter0_d_8908_374939" x="0.137299" y="5.25" width="24.7254" height="22.75" filterUnits="userSpaceOnUse" color-interpolation-filters="sRGB">
<feFlood flood-opacity="0" result="BackgroundImageFix"/>
<feColorMatrix in="SourceAlpha" type="matrix" values="0 0 0 0 0 0 0 0 0 0 0 0 0 0 0 0 0 0 127 0" result="hardAlpha"/>
<feOffset dy="4"/>
<feGaussianBlur stdDeviation="2"/>
<feComposite in2="hardAlpha" operator="out"/>
<feColorMatrix type="matrix" values="0 0 0 0 0 0 0 0 0 0 0 0 0 0 0 0 0 0 0.25 0"/>
<feBlend mode="normal" in2="BackgroundImageFix" result="effect1_dropShadow_8908_374939"/>
<feBlend mode="normal" in="SourceGraphic" in2="effect1_dropShadow_8908_374939" result="shape"/>
</filter>
</defs>
</svg>
