digraph {
    node [ shape="plaintext" ]

    Person [ label=<
    <table border="0" cellborder="1" cellspacing="0">
        <tr><td colspan="2">Person</td></tr>
        <tr><td>name</td><td>'Osoba'</td></tr>
        <tr><td>department</td><td port="dept"></td></tr>
        <tr><td>__proto__</td><td port="__p"></td></tr>
    </table>
    >]

    Object_p[ label=<
    <table border="0" cellborder="1" cellspacing="0">
        <tr><td colspan="2">Object.prototype</td></tr>
        <tr><td>__proto__</td><td>null</td></tr>
    </table>
    > ]

    dept1 [ label=<
    <table border="0" cellborder="1" cellspacing="0">
        <tr><td>name</td><td>'Management'</td></tr>
        <tr><td>area</td><td>'global'</td></tr>
    </table>
    > ]

    alois [ label=<
    <table border="0" cellborder="1" cellspacing="0">
        <tr><td colspan="2">alois</td></tr>
        <tr><td>name</td><td>'Alois'</td></tr>
        <tr><td>__proto__</td><td port="__p"></td></tr>
    </table>
    > ]

    Person:dept -> dept1
    alois:__p -> Person
    Person:__p -> Object_p
}