C:\Users\d070727\git-projects\workshop-mockito\src\main\java\ClockWidget.java
C:\Users\d070727\git-projects\workshop-mockito\src\main\java\Logger.java
C:\Users\d070727\git-projects\workshop-mockito\src\main\java\Position.java
C:\Users\d070727\git-projects\workshop-mockito\src\main\java\WeatherWidget.java
C:\Users\d070727\git-projects\workshop-mockito\src\main\java\IPublisher.java
C:\Users\d070727\git-projects\workshop-mockito\src\main\java\Widget.java
C:\Users\d070727\git-projects\workshop-mockito\src\main\java\Publisher.java
C:\Users\d070727\git-projects\workshop-mockito\src\main\java\Weather.java
C:\Users\d070727\git-projects\workshop-mockito\src\main\java\IObserver.java
C:\Users\d070727\git-projects\workshop-mockito\src\main\java\Screen.java
C:\Users\d070727\git-projects\workshop-mockito\src\main\java\WidgetFactory.java
