{
  "Version": "2012-10-17",
  "Statement": [
    {
      "Sid": "IAMOpenIDConnectPermissions",
      "Effect": "Allow",
      "Action": [
        "iam:CreateOpenIDConnectProvider",
        "iam:DeleteOpenIDConnectProvider",
        "iam:GetOpenIDConnectProvider",
        "iam:TagOpenIDConnectProvider",
        "iam:UntagOpenIDConnectProvider"
      ],
      "Resource": "arn:aws:iam::*:oidc-provider/*"
    }
  ]
}