<?xml version="1.0" encoding="utf-8"?>
<!-- Generator: Adobe Illustrator 22.0.1, SVG Export Plug-In . SVG Version: 6.00 Build 0)  -->
<svg version="1.1" id="Layer_1" xmlns="http://www.w3.org/2000/svg" xmlns:xlink="http://www.w3.org/1999/xlink" x="0px" y="0px"
	 viewBox="0 0 50 50" style="enable-background:new 0 0 50 50;" xml:space="preserve">
<style type="text/css">
	.st0{fill:#75B7FF;}
	.st1{fill:#009BE6;}
	.st2{fill:#FFFFFF;}
	.st3{fill:#F7B951;}
	.st4{fill:#F5A72F;}
	.st5{fill:#CEA7FD;}
	.st6{fill:#BF8CFC;}
	.st7{fill:#E197FD;}
	.st8{fill:#D167FC;}
	.st9{fill:#E27ABA;}
	.st10{fill:#DE4DA0;}
</style>
<path class="st9" d="M41.2,50H8.8C4,50,0,46,0,41.2V8c0-4.4,3.6-8,8-8h34c4.4,0,8,3.6,8,8v33.2C50,46,46,50,41.2,50z"/>
<path class="st10" d="M42,50H8c-4.4,0-8-3.6-8-8V25h50v17C50,46.4,46.4,50,42,50z"/>
<g>
	<path class="st2" d="M18.4,9.5v27.6H13V9.5H18.4z"/>
	<path class="st2" d="M37.1,8.8v22.4c0,1.9,0.1,4.1,0.2,5.9h-4.6l-0.3-2.3h-0.1c-0.7,1.4-2.3,2.6-4.2,2.6c-4.3,0-6.2-4.7-6.2-10.3
		c0-7,3-10.4,6.4-10.4c1.8,0,2.9,0.9,3.4,2h0.1v-10H37.1z M31.7,24.8c0-0.4,0-0.8,0-1.2c-0.2-1.2-0.9-2.3-1.9-2.3
		c-1.9,0-2.6,2.7-2.6,6c0,3.8,1,5.8,2.5,5.8c0.7,0,1.4-0.4,1.8-1.8c0.1-0.3,0.2-0.7,0.2-1.2V24.8z"/>
</g>
</svg>
