<?xml version="1.0" encoding="utf-8"?>
<!-- Generator: Adobe Illustrator 22.0.1, SVG Export Plug-In . SVG Version: 6.00 Build 0)  -->
<svg version="1.1" xmlns="http://www.w3.org/2000/svg" xmlns:xlink="http://www.w3.org/1999/xlink" x="0px" y="0px"
	 viewBox="0 0 250 165" style="enable-background:new 0 0 250 165;" xml:space="preserve">
<style type="text/css">
	.st0{fill:#EEE844;}
	.st1{fill:#FFC17B;}
	.st2{fill:#E1DC97;}
	.st3{fill:#61758B;}
	.st4{fill:#48555F;}
	.st5{fill:#FFF5EF;}
	.st6{fill:#CCCCCC;}
	.st7{fill:#558136;}
	.st8{fill:#527230;}
	.st9{fill:#86B445;}
	.st10{fill:#CC6B3B;}
	.st11{fill:#BABABA;}
	.st12{fill:#DAFCFF;}
	.st13{fill:#873629;}
	.st14{fill:#665858;}
	.st15{fill:#009D3E;}
	.st16{fill:#915200;}
</style>
<g id="Layer_6">
</g>
<g id="Päikese_kuma">
	<circle class="st0" cx="115.1" cy="81.4" r="42.6"/>
</g>
<g id="Päike">
	<circle class="st1" cx="115.1" cy="81.4" r="27"/>
</g>
<g id="Layer_4">
	<g id="SAAR">
		<path id="LIIV" class="st2" d="M245.8,165.5H4.2c-2.3,0-4.2-1.9-4.2-4.2l0,0c0-2.3,1.9-4.2,4.2-4.2h241.7c2.3,0,4.2,1.9,4.2,4.2
			l0,0C250,163.6,248.1,165.5,245.8,165.5z"/>
		<g id="mÄGI">
			<polygon class="st3" points="80.9,0.4 48.7,118.8 113.1,118.8 			"/>
			<polygon class="st3" points="113.1,118.8 48.7,118.8 72.1,32.6 78.6,8.7 80.9,0.4 83.1,8.7 89.6,32.6 			"/>
			<polygon class="st4" points="113.1,118.8 88.1,118.8 80.9,0.4 			"/>
			<polygon class="st4" points="113.1,118.8 88.1,118.8 82.8,32.6 81.4,8.7 80.9,0.4 83.1,8.7 89.6,32.6 			"/>
			<polygon class="st5" points="82.8,32.6 72.1,32.6 78.6,8.7 80.9,0.4 81.4,8.7 			"/>
			<polygon class="st6" points="89.6,32.6 82.8,32.6 81.4,8.7 80.9,0.4 83.1,8.7 			"/>
		</g>
		<g id="mÄGI_1_">
			<polygon class="st3" points="119.3,59.6 87.1,129.1 151.5,129.1 			"/>
			<polygon class="st4" points="151.5,129.1 126.6,129.1 119.3,59.6 			"/>
		</g>
		<g id="mÄGI_2_">
			<polygon class="st3" points="152.5,34.6 115.1,129.1 189.9,129.1 			"/>
			<polygon class="st4" points="189.9,129.1 161,129.1 152.5,34.6 			"/>
		</g>
		<g id="KÜNKAD">
			<path class="st7" d="M150.4,157.2H10.2c0-31,31.4-56.1,70.1-56.1S150.4,126.2,150.4,157.2z"/>
			<path class="st8" d="M240.8,157.2H124.5c0-22.9,26-41.5,58.2-41.5S240.8,134.2,240.8,157.2z"/>
			<path class="st9" d="M206.5,157.2H73.6c0-17.8,29.8-32.2,66.5-32.2S206.5,139.4,206.5,157.2z"/>
		</g>
	</g>
</g>
<g id="Layer_3">
	<g id="MAJA">
		<path class="st10" d="M156,128.3h-23.1v-11.5c0-6.4,5.2-11.5,11.5-11.5l0,0c6.4,0,11.5,5.2,11.5,11.5v11.5H156z"/>
		<path class="st11" d="M149.7,111L149.7,111c-1,0-1.9-0.9-1.9-1.9v-8h3.8v8C151.6,110.2,150.7,111,149.7,111z"/>
		<circle class="st12" cx="138.7" cy="116.9" r="4.1"/>
		<path class="st13" d="M153.3,128.3h-7v-10.8c0-1.6,1.3-2.9,2.9-2.9h1.2c1.6,0,2.9,1.3,2.9,2.9L153.3,128.3L153.3,128.3z"/>
		<path class="st14" d="M156.8,129.1h-25.4c-0.5,0-0.9-0.4-0.9-0.9v-0.6c0-0.5,0.4-0.9,0.9-0.9h25.4c0.5,0,0.9,0.4,0.9,0.9v0.6
			C157.7,128.8,157.3,129.1,156.8,129.1z"/>
	</g>
</g>
<g id="Layer_2">
	<g id="PUU">
		<ellipse class="st15" cx="42.7" cy="136.8" rx="10.2" ry="7.7"/>
		<g id="TÜVI">
			<path class="st16" d="M42.1,160.3h-0.4c-0.4,0-0.6-0.3-0.6-0.6v-21.3c0-0.4,0.3-0.6,0.6-0.6h0.4c0.4,0,0.6,0.3,0.6,0.6v21.3
				C42.7,160,42.4,160.3,42.1,160.3z"/>
			<path class="st16" d="M42.2,143.2l-0.5-0.5c-0.1-0.1-0.1-0.4,0-0.5l5.2-5.2c0.1-0.1,0.4-0.1,0.5,0l0.5,0.5c0.1,0.1,0.1,0.4,0,0.5
				l-5.2,5.2C42.5,143.3,42.3,143.3,42.2,143.2z"/>
		</g>
	</g>
</g>
</svg>
