<?xml version="1.0" encoding="utf-8"?>
<!-- Generator: Adobe Illustrator 22.0.1, SVG Export Plug-In . SVG Version: 6.00 Build 0)  -->
<svg version="1.1" id="Layer_1" xmlns="http://www.w3.org/2000/svg" xmlns:xlink="http://www.w3.org/1999/xlink" x="0px" y="0px"
	 viewBox="0 0 670 360" style="enable-background:new 0 0 670 360;" xml:space="preserve">
<style type="text/css">
	.st0{fill:#164194;}
	.st1{fill:#6DB22D;}
	.st2{fill:#FFED00;}
	.st3{fill:#FFFFFF;}
</style>
<g>
	<path class="st0" d="M185-157.5c-3.7,0-5.9-2.3-5.9-6.4v-7.9c0-5.8,3.6-6.4,8.5-6.4h1.9c4.3,0,5.6,1.8,5.6,5.9v0.6h-2.3v-0.6
		c0-2.9-0.6-3.9-3.6-3.9h-1.3c-4.8,0-6.5,0.6-6.5,4.3v5.6c0,4.6,0.2,6.7,4.1,6.7h2.7c3.7,0,4.8-0.5,4.8-3.4v-1.6h2.3v1.9
		c0,4.7-3,5.2-7.1,5.2L185-157.5L185-157.5z"/>
	<path class="st0" d="M203.7-172.1c5.3,0,6.3,1.3,6.3,7.3s-1,7.3-6.3,7.3s-6.3-1.3-6.3-7.3S198.4-172.1,203.7-172.1 M203.7-159.3
		c3.8,0,4.1-0.6,4.1-5.5c0-5-0.3-5.6-4.1-5.6s-4.1,0.6-4.1,5.6C199.6-159.8,199.9-159.3,203.7-159.3"/>
	<path class="st0" d="M215.4-170.2L215.4-170.2c0.7-1.7,2.8-1.9,4.5-1.9c3.7,0,5.4,1,5.4,4.9v9.5h-2.1v-9.6c0-2.6-1-3-3.4-3
		c-3.5,0-4.3,1.1-4.3,4.4v8.3h-2.1v-14.3h2.1L215.4-170.2L215.4-170.2z"/>
	<path class="st0" d="M231.2-170.2L231.2-170.2c0.7-1.7,2.8-1.9,4.5-1.9c3.7,0,5.4,1,5.4,4.9v9.5H239v-9.6c0-2.6-1-3-3.4-3
		c-3.5,0-4.3,1.1-4.3,4.4v8.3h-2.1v-14.3h2.1L231.2-170.2L231.2-170.2z"/>
	<path class="st0" d="M256.9-162v0.5c0,3.8-2.9,4-6.1,4c-5.6,0-6.4-1.8-6.4-7.3c0-5.9,1.3-7.3,6.4-7.3c4.6,0,6.1,1.1,6.1,6.3v1.4
		h-10.3c0,4.5,0.3,5.1,4.2,5.1c2.9,0,3.9-0.2,3.9-2.2v-0.5H256.9z M254.6-166.1c-0.1-4-0.6-4.3-3.9-4.3c-3.9,0-4,1-4.2,4.3H254.6z"
		/>
	<path class="st0" d="M272-162.8v0.8c0,4-2.7,4.5-6.1,4.5c-5.9,0-6.3-2.3-6.3-7.6c0-4.6,0.8-7,6-7c3.4,0,6.2,0.4,6.2,4.4v0.4h-2.1
		v-0.4c0-2.6-1.4-2.6-3.9-2.6c-3.8,0-3.9,1.3-3.9,5.9c0,4,0.2,5.2,4.3,5.2c2.7,0,3.7-0.3,3.7-2.9v-0.7L272-162.8L272-162.8z"/>
	<path class="st0" d="M282.5-170.2H277v9c0,1.5,0.4,1.9,2,1.9c2,0,2-1.1,2-2.4v-1.1h2v1.1c0,2.8-1.2,4.2-4.1,4.2
		c-3.3,0-4.1-0.9-4.1-4.3v-8.4H273v-1.7h1.9v-3.5h2.1v3.5h5.5V-170.2z"/>
	<path class="st0" d="M287.1-175.7H285v-2.4h2.1V-175.7z M287.1-157.7H285V-172h2.1V-157.7z"/>
	<path class="st0" d="M292.9-170.2L292.9-170.2c0.7-1.7,2.8-1.9,4.5-1.9c3.7,0,5.4,1,5.4,4.9v9.5h-2.1v-9.6c0-2.6-1-3-3.4-3
		c-3.5,0-4.3,1.1-4.3,4.4v8.3h-2.1v-14.3h2.1v1.7H292.9z"/>
	<path class="st0" d="M318.5-156c0,3.8-2.8,4.6-6.3,4.6c-3.3,0-5.9-0.5-5.7-4.6h2.2c0,2.7,1.3,2.9,3.6,2.9c2.6,0,4.1-0.3,4.1-3.1
		v-3.3h-0.1c-0.6,1.7-2.9,1.9-4.6,1.9c-4.6,0-5.6-2.4-5.6-7.3c0-4.8,0.7-7.3,5.6-7.3c2,0,3.8,0.3,4.6,2h0.1v-1.8h2.1L318.5-156
		L318.5-156z M316.3-164.8c0-4-0.3-5.6-4.1-5.6c-4,0-3.9,1.8-3.9,5.6c0,3.4-0.2,5.5,3.9,5.5C316.3-159.2,316.3-161.6,316.3-164.8"/>
	<path class="st0" d="M333.6-169.7L333.6-169.7c0.8-1.8,3-2.4,4.8-2.4c1.7,0,3.9,0.5,4.4,2.4c1-1.9,3.2-2.4,5.1-2.4
		c3.7,0,4.9,1.5,4.9,5v9.4h-2.1v-9.2c0-2.4-0.4-3.5-3.1-3.5c-3,0-4.3,0.9-4.3,3.9v8.7H341v-9.6c-0.1-1.9-0.1-3.1-3.2-3.1
		c-2.8,0-4.3,1.2-4.3,4.1v8.6h-2.1v-14.3h2.1v2.4H333.6z"/>
	<path class="st0" d="M366.1-157.7v-1.5l-0.1-0.1c-0.8,1.6-2.9,1.7-4.7,1.7c-3.2,0-5.4-0.6-5.4-4.3c0-3.9,2-4.5,5.6-4.5
		c1.4,0,4.2,0.1,4.5,1.4h0.1v-2.6c0-2.6-1.4-2.9-3.8-2.9c-1.7,0-3.7,0-3.7,2v0.5h-2.2v-0.3c0-3.7,2.5-3.9,5.7-3.9
		c3.6,0,6.2,0.4,6.2,4.7v9.7h-2.2V-157.7z M366.1-161.9c0-2.7-1.6-2.7-4.3-2.7c-2.6,0-3.6,0.2-3.6,2.5c0,2.7,1.1,2.9,3.6,2.9
		C363.9-159.2,366.1-159.3,366.1-161.9"/>
	<path class="st0" d="M379.5-170.2H374v9c0,1.5,0.4,1.9,2,1.9c2,0,2-1.1,2-2.4v-1.1h2v1.1c0,2.8-1.2,4.2-4.1,4.2
		c-3.3,0-4.1-0.9-4.1-4.3v-8.4h-1.9v-1.7h1.9v-3.5h2.1v3.5h5.5v1.7H379.5z"/>
	<path class="st0" d="M389.4-170.2h-5.5v9c0,1.5,0.4,1.9,2,1.9c2,0,2-1.1,2-2.4v-1.1h2v1.1c0,2.8-1.2,4.2-4.1,4.2
		c-3.3,0-4.1-0.9-4.1-4.3v-8.4h-1.9v-1.7h1.9v-3.5h2.1v3.5h5.5v1.7H389.4z"/>
	<path class="st0" d="M403.9-162v0.5c0,3.8-2.9,4-6.1,4c-5.6,0-6.4-1.8-6.4-7.3c0-5.9,1.3-7.3,6.4-7.3c4.6,0,6.1,1.1,6.1,6.3v1.4
		h-10.3c0,4.5,0.3,5.1,4.2,5.1c2.9,0,3.9-0.2,3.9-2.2v-0.5H403.9z M401.7-166.1c-0.1-4-0.6-4.3-3.9-4.3c-3.9,0-4,1-4.2,4.3H401.7z"
		/>
	<path class="st0" d="M409-171.9l-0.1,1.8l0.1,0.1c0.7-1.6,2.4-2,4-2c2.7,0,4,1.4,4,4v1h-2v-0.9c0-1.8-0.6-2.4-2.4-2.4
		c-2.7,0-3.5,1.3-3.5,3.8v8.9H407v-14.3L409-171.9L409-171.9z"/>
	<path class="st0" d="M430.5-168.2h-2.2v-0.5c0-1.4-1.1-1.4-3.3-1.4c-2.7,0-4,0-4,1.7c0,2.6,0.7,2.4,2.9,2.5c3.7,0.2,7-0.4,7,4.3
		c0,4-2.8,4.2-5.9,4.2s-6.3-0.2-6.3-3.3v-1.3h2.2v1.1c0,1.4,0.8,1.7,4.1,1.7c1.5,0,3.7,0.3,3.7-2.2c0-2.7-1.1-2.2-3.7-2.3
		c-3.1-0.2-6.2,0.1-6.2-3.9c0-4.1,2.4-4.2,6.2-4.2c2.5,0,5.6,0.1,5.6,3.3v0.3H430.5z"/>
	<rect x="-95.7" y="-252" class="st0" width="4.8" height="4.8"/>
	<rect x="-95.7" y="-242.6" class="st0" width="4.8" height="37.8"/>
	<path class="st0" d="M-81.6-252h4.8v9.5H-58v4.7h-18.8v23.6c0,2.6,2,4.8,4.7,4.8H-58v4.7h-14.2c-4.9,0-9.5-4-9.5-9.5v-23.6h-7.1
		v-4.7h7.1L-81.6-252L-81.6-252z"/>
	<path class="st0" d="M-105.8-228.4h-31.5c0.1-3.5,1-5.9,2.6-7.2c1.1-1,2.5-1.6,4.6-1.9c1.9-0.5,4.8-0.6,8.6-0.6
		c3.7,0,6.6,0.1,8.6,0.6c1.9,0.4,3.5,1,4.6,1.9C-106.7-234.3-105.8-231.9-105.8-228.4 M-137.4-223.6h36.9c0-4.2-0.2-7.3-0.7-9.4
		c-0.5-2-1.3-3.8-2.5-5.4c-1.6-1.8-3.5-3.1-6-3.7c-2.4-0.6-6.5-1-12-1c-5.6,0-9.6,0.4-12.1,1s-4.4,1.9-5.9,3.7
		c-1.3,1.6-2.2,3.4-2.5,5.4c-0.5,2-0.7,5.2-0.8,9.4c0.1,4.1,0.4,7.2,0.8,9.2c0.4,2,1.2,3.8,2.5,5.4c1.4,1.8,3.4,3.1,5.9,3.7
		c2.5,0.7,6.5,1,12.1,1c5.5,0,9.6-0.2,12-1c2.5-0.6,4.4-1.9,6-3.7c1-1.2,1.7-2.6,2.2-4.1h-5.6c-0.4,0.5-0.7,1-1.2,1.4
		c-1.1,0.8-2.6,1.6-4.6,1.9c-2,0.4-4.9,0.5-8.6,0.5c-3.8,0-6.7-0.1-8.6-0.5c-2-0.4-3.5-1.1-4.6-1.9c-1.4-1.2-2.3-3.2-2.5-6
		C-137.4-219.5-137.4-221.7-137.4-223.6"/>
	<path class="st0" d="M-100.4-138.6c46.9,0,85-38,85-85c0-47.1-38.1-85.1-85-85.1c-15.5,0-30,4.1-42.5,11.4l4.7,8.2
		c11.2-6.5,24-10.1,37.8-10.1c41.7,0,75.6,33.8,75.6,75.6c0,41.6-33.8,75.6-75.6,75.6s-75.6-34-75.6-75.6h-9.5
		C-185.5-176.7-147.3-138.6-100.4-138.6"/>
	<path class="st1" d="M-100.4-157.5c24.5,0,45.8-13.3,57.2-33.1l-8.2-4.7c-9.8,16.9-28.1,28.3-49.1,28.3
		c-31.3,0-56.6-25.4-56.6-56.7s25.3-56.8,56.6-56.8c21,0,39.2,11.4,49.1,28.3l8.2-4.7c-11.4-19.8-32.7-33.1-57.2-33.1
		c-36.5,0-66.1,29.6-66.1,66.3C-166.5-187.1-136.9-157.5-100.4-157.5"/>
	<path class="st0" d="M398.3-213.9h4.4v0.7c0,1.4,0.1,2.4,0.5,3c0.2,0.6,0.8,1.1,1.8,1.4c1.2,0.5,4.6,0.6,10.3,0.6
		c3.6,0,6,0,7.4-0.2c1.4-0.1,2.4-0.4,3-0.8c0.8-0.7,1.2-1.7,1.2-3c0-1.6-0.5-2.6-1.4-3.2c-1-0.5-2.9-0.8-5.4-0.8
		c-0.8,0-4.9,0-12-0.1c-1.9,0-3.4-0.1-4.6-0.5c-1.1-0.2-2-0.6-2.8-1.2c-1.4-1.1-2-2.9-2-5.5c0-2.8,0.8-4.7,2.6-6
		c0.8-0.6,2.4-1.1,4.4-1.3c2.2-0.4,5.2-0.5,9.1-0.5c4.4,0,7.7,0.2,9.7,0.7c2.2,0.5,3.7,1.3,4.7,2.6c0.5,0.5,0.7,1.2,1,1.8
		c0.1,0.7,0.1,1.8,0.1,3.4H426c0-1.7-0.4-2.6-0.8-3.2c-0.6-0.5-1.7-1-3.4-1.2c-1.6-0.2-4-0.4-7.1-0.4c-5.6,0-9.1,0.4-10.3,1.2
		c-1,0.6-1.3,1.6-1.3,3s0.5,2.4,1.4,2.8c1.1,0.5,3.1,0.7,6.4,0.6c3,0,7.1,0.1,12,0.2c3,0.1,5.2,0.8,6.5,2s1.9,3.1,1.9,5.6
		c0,1.6-0.2,2.9-0.6,3.8c-0.5,1-1.2,1.8-2.3,2.4c-1,0.6-2.4,1-4.4,1.2s-5,0.4-8.9,0.4c-4.3,0-7.6-0.1-9.7-0.4
		c-2-0.4-3.6-0.7-4.6-1.4c-1-0.6-1.7-1.4-2-2.4c-0.5-1-0.6-2.3-0.6-4L398.3-213.9L398.3-213.9z M390.2-204.7h4.1v-37.8h-4.1V-204.7z
		 M369.4-216.7c-3.4,0-5.8,0.1-7.1,0.2c-1.4,0.1-2.4,0.4-3,0.6c-1.1,0.7-1.6,1.9-1.6,3.6c0,1.7,0.6,2.9,1.9,3.5
		c1.1,0.5,4.6,0.7,10.6,0.7c4.4,0,7.4-0.2,8.8-0.8s2.2-1.7,2.2-3.5c0-1.7-0.7-2.8-2.4-3.4C377.2-216.4,374.1-216.7,369.4-216.7
		 M358.8-223.1h-4.3c-0.1-0.5-0.1-0.8-0.1-1.2c0-2.6,1.1-4.6,3.1-5.5c2-1.1,6-1.6,11.6-1.6c4.4,0,7.7,0.2,9.6,0.6
		c2,0.5,3.5,1.2,4.7,2.4c0.8,0.8,1.4,1.9,1.8,3.2c0.2,1.2,0.4,3.5,0.4,6.6v13.8h-4.1v-3.1h-0.2c-1,1.4-2.2,2.4-3.7,2.9
		c-1.4,0.4-4.1,0.6-8.2,0.6c-4.6,0-7.8-0.1-9.6-0.4c-1.8-0.2-3.1-0.7-4.1-1.3c-0.8-0.7-1.6-1.6-1.9-2.4c-0.4-1-0.5-2.3-0.5-4
		c0-1.9,0.2-3.5,0.8-4.7c0.5-1.1,1.4-1.8,2.8-2.4c1.3-0.6,4.7-1,9.7-1c5.4,0,9,0.2,10.7,0.6c1.6,0.2,2.9,1.1,3.8,2.3h0.4v-2.9
		c0-2.3-0.5-4-1.3-4.9c-0.7-1-1.8-1.6-3.4-1.8c-1.4-0.4-4-0.5-7.3-0.5c-4.6,0-7.4,0.2-8.8,0.7c-1.3,0.6-1.9,1.7-1.9,3.5V-223.1z
		 M345.4-237.6h4.1v-4.9h-4.1V-237.6z M345.4-204.7h4.1V-231h-4.1V-204.7z M314.4-204.7h4.1v-12.1c0-4.6,0.7-7.6,2.2-8.9
		c1.4-1.3,4.6-1.9,9.6-1.9c3.4,0,5.5,0.5,6.6,1.4c0.5,0.5,0.8,1.1,1,1.8c0.2,0.8,0.4,1.9,0.4,3.4v1.9h4.2v-2.8
		c0-3.5-0.8-5.9-2.6-7.4c-0.8-0.7-1.9-1.3-3.2-1.6c-1.2-0.2-3.2-0.5-5.8-0.5c-2.6,0-4.6,0.1-5.9,0.2c-1.3,0.2-2.3,0.5-3.1,0.8
		c-1.3,0.7-2.3,1.7-3,2.9h-0.2v-3.6h-4.1v26.4H314.4z M306-220.5c0-2.6-0.7-4.4-2-5.4c-1-0.7-2.2-1.2-3.7-1.4
		c-1.7-0.2-4-0.4-7.1-0.4c-2.6,0-4.8,0.1-6.1,0.4c-1.4,0.2-2.5,0.7-3.4,1.3c-1.3,1-2,2.9-2.3,5.5L306-220.5L306-220.5z M306.2-212.8
		h4.3c0,3.1-1.1,5.3-3.2,6.5c-2.2,1.3-5.9,1.9-11.2,1.9c-4.4,0-7.8-0.2-10.1-0.5c-2.3-0.4-4-1-5.2-1.8c-2.6-1.9-4-5.6-4-11.2
		c0-3.8,0.6-6.8,1.7-8.8c1.1-1.8,2.6-3.1,4.7-3.7c1.9-0.7,5.4-1.1,10.1-1.1c4.6,0,7.8,0.2,9.8,0.7c1.9,0.5,3.6,1.4,4.8,2.8
		c1,1.2,1.7,2.5,2,4.1c0.4,1.4,0.6,3.7,0.6,6.8h-29.3c0.1,3.4,0.7,5.5,1.9,6.7c0.8,0.8,2,1.4,3.8,1.8c1.7,0.2,4.6,0.4,8.5,0.4
		c3,0,5.2-0.1,6.5-0.4c1.4-0.2,2.4-0.8,3.1-1.6C305.7-210.6,306-211.5,306.2-212.8 M251.1-231h-6.5v3.6h6.5v12.7c0,2,0,3.6,0.2,4.7
		c0.2,1,0.6,1.9,1.2,2.6c0.7,1.1,1.9,1.8,3.6,2.3c1.6,0.5,3.7,0.7,6.6,0.7c2.8,0,4.9-0.2,6.5-0.7c1.4-0.6,2.6-1.3,3.5-2.5
		c0.5-0.8,0.8-1.7,1.1-2.8c0.1-1.1,0.2-2.5,0.2-4.6v-1.7h-4.1v1.7c0,1.6-0.1,2.8-0.2,3.4c0,0.7-0.2,1.2-0.6,1.7
		c-0.5,0.7-1.1,1.2-1.9,1.4s-2.3,0.4-4.1,0.4c-2,0-3.6-0.1-4.6-0.4c-1.1-0.2-1.8-0.7-2.4-1.3c-0.4-0.6-0.6-1.2-0.7-1.7
		c-0.1-0.6-0.2-2.2-0.2-4.6v-11.4h18.4v-3.6h-18.4v-6.5h-4.1V-231z M226.5-216.7c-3.4,0-5.8,0.1-7.1,0.2c-1.4,0.1-2.4,0.4-2.9,0.6
		c-1.2,0.7-1.7,1.9-1.7,3.6c0,1.7,0.6,2.9,1.9,3.5c1.1,0.5,4.6,0.7,10.7,0.7c4.3,0,7.3-0.2,8.6-0.8c1.4-0.6,2.2-1.7,2.2-3.5
		c0-1.7-0.7-2.8-2.4-3.4C234.3-216.4,231.1-216.7,226.5-216.7 M215.9-223.1h-4.3c0-0.5-0.1-0.8-0.1-1.2c0-2.6,1.1-4.6,3.1-5.5
		c2-1.1,6-1.6,11.6-1.6c4.4,0,7.7,0.2,9.6,0.6c2,0.5,3.5,1.2,4.7,2.4c0.8,0.8,1.4,1.9,1.8,3.2c0.2,1.2,0.4,3.5,0.4,6.6v13.8h-4.1
		l0.1-3.1h-0.2c-1.1,1.4-2.3,2.4-3.7,2.9c-1.4,0.4-4.2,0.6-8.3,0.6c-4.6,0-7.8-0.1-9.6-0.4c-1.8-0.2-3.1-0.7-4.1-1.3
		c-0.8-0.7-1.6-1.6-1.9-2.4c-0.4-1-0.5-2.3-0.5-4c0-1.9,0.2-3.5,0.8-4.7c0.5-1.1,1.4-1.8,2.8-2.4c1.3-0.6,4.7-1,9.8-1
		c5.4,0,8.9,0.2,10.6,0.6c1.7,0.2,2.9,1.1,3.8,2.3h0.4v-2.9c0-2.3-0.5-4-1.3-4.9c-0.7-1-1.8-1.6-3.4-1.8c-1.4-0.4-4-0.5-7.3-0.5
		c-4.4,0-7.4,0.2-8.8,0.7c-1.3,0.6-1.9,1.7-1.9,3.5L215.9-223.1L215.9-223.1z M145.3-204.7h5v-33.1h2.2l21.4,33.1h4.1l21.1-33.1h2.2
		v33.1h5v-37.8h-10.2l-20.2,32l-20.5-32h-10.1V-204.7z M102.2-204.7h6.1l8-22.3h0.4l8.2,22.3h6.1l12.2-26.3h-4.8l-10.2,22.4h-0.4
		l-8-22.4h-6.6l-7.9,22.4H105L94.9-231h-4.7L102.2-204.7z M73.2-216.7c-3.4,0-5.8,0.1-7.2,0.2c-1.3,0.1-2.3,0.4-2.9,0.6
		c-1.1,0.7-1.7,1.9-1.7,3.6c0,1.7,0.7,2.9,2,3.5c1,0.5,4.6,0.7,10.6,0.7c4.4,0,7.3-0.2,8.8-0.8c1.4-0.6,2.2-1.7,2.2-3.5
		c0-1.7-0.8-2.8-2.4-3.4C81-216.4,77.9-216.7,73.2-216.7 M62.5-223.1h-4.3v-1.2c0-2.6,1-4.6,3.1-5.5c2-1.1,5.9-1.6,11.6-1.6
		c4.4,0,7.7,0.2,9.6,0.6c1.9,0.5,3.5,1.2,4.6,2.4c1,0.8,1.6,1.9,1.8,3.2c0.4,1.2,0.5,3.5,0.5,6.6v13.8h-4.2l0.1-3.1h-0.2
		c-1,1.4-2.3,2.4-3.7,2.9c-1.4,0.4-4.2,0.6-8.2,0.6c-4.7,0-7.8-0.1-9.6-0.4c-1.8-0.2-3.1-0.7-4.1-1.3c-1-0.7-1.6-1.6-1.9-2.4
		c-0.4-1-0.6-2.3-0.6-4c0-1.9,0.4-3.5,0.8-4.7c0.6-1.1,1.4-1.8,2.8-2.4c1.4-0.6,4.7-1,9.8-1c5.4,0,8.9,0.2,10.6,0.6
		c1.7,0.2,3,1.1,3.8,2.3h0.4v-2.9c0-2.3-0.4-4-1.2-4.9c-0.7-1-1.9-1.6-3.4-1.8c-1.6-0.4-4-0.5-7.4-0.5c-4.4,0-7.3,0.2-8.6,0.7
		c-1.3,0.6-2,1.7-2,3.5v0.5H62.5z M15.4-223.7h18.5c4.9,0,8-0.1,9.5-0.2c1.3-0.1,2.5-0.5,3.4-1c1.3-0.8,1.9-3,1.9-6.4
		c0-2.8-0.6-4.7-1.8-5.5c-0.7-0.5-1.9-0.8-3.6-1.1c-1.7-0.1-4.8-0.2-9.4-0.2H15.4V-223.7z M10.4-204.7v-37.8h23.5
		c6.4,0.1,10.4,0.2,12.2,0.5c3.1,0.4,5.3,1.8,6.5,4.2c0.8,1.6,1.2,3.8,1.2,6.7c0,2.2-0.1,3.8-0.4,5c-0.2,1.1-0.6,2-1.3,2.6
		c-1,1.1-2.4,1.9-4.6,2.4c1.7,0.2,2.9,0.8,3.8,1.8c0.7,0.8,1.2,1.7,1.4,2.8s0.4,3.2,0.4,6.4v5.4h-5v-3.6c0-3.1-0.1-5.3-0.2-6.4
		c-0.4-2.4-1.7-3.8-4.1-4.3c-1-0.1-1.8-0.1-2.5-0.1c-0.7-0.1-3.1-0.1-7.4-0.1H15.4v14.5L10.4-204.7L10.4-204.7z"/>
</g>
<g>
	<rect x="403.6" y="79.5" class="st0" width="265.4" height="174.1"/>
	<polygon class="st2" points="530.6,117.4 536.2,113.3 541.8,117.4 539.7,110.8 545.4,106.9 538.4,106.9 536.2,100.4 534,106.9 
		527,106.9 532.8,110.8 	"/>
	<polygon class="st2" points="501.6,125 507.2,121 512.8,125 510.6,118.6 516.4,114.6 509.4,114.6 507.2,108 505,114.6 498,114.6 
		503.8,118.6 	"/>
	<polygon class="st2" points="486,128.9 484,135.5 476.9,135.5 482.6,139.5 480.4,145.9 486,142 491.6,145.9 489.4,139.5 
		495.2,135.5 488.2,135.5 	"/>
	<polygon class="st2" points="478.2,170.4 483.8,174.5 481.8,167.9 487.4,163.9 480.4,163.9 478.2,157.3 476.2,163.9 469.1,163.9 
		474.8,167.9 472.7,174.5 	"/>
	<polygon class="st2" points="488.2,192.4 486,185.9 484,192.6 476.9,192.4 482.6,196.5 480.4,203 486,199 491.6,203 489.6,196.5 
		495.2,192.4 	"/>
	<polygon class="st2" points="509.4,213.3 507.2,206.8 505.2,213.5 498.2,213.3 503.8,217.4 501.7,223.9 507.2,219.9 512.8,223.9 
		510.8,217.4 516.4,213.3 	"/>
	<polygon class="st2" points="538.4,221 536.2,214.4 534,221 527,221 532.8,225 530.6,231.4 536.2,227.5 541.8,231.4 539.7,225 
		545.4,221 	"/>
	<polygon class="st2" points="567.3,213.3 565.1,206.8 563.1,213.5 556,213.3 561.7,217.4 559.6,223.9 565.1,219.9 570.7,223.9 
		568.7,217.4 574.3,213.3 	"/>
	<polygon class="st2" points="588.5,192.4 586.5,185.9 584.3,192.6 577.3,192.4 582.9,196.5 580.8,203 586.5,199 591.9,203 
		589.9,196.5 595.5,192.4 	"/>
	<polygon class="st2" points="603.3,163.9 596.3,163.9 594.1,157.3 591.9,163.9 584.9,163.9 590.7,167.9 588.5,174.3 594.1,170.3 
		599.7,174.3 597.5,167.9 	"/>
	<polygon class="st2" points="580.8,145.9 586.5,141.9 592.1,145.9 589.9,139.4 595.5,135.3 588.5,135.3 586.5,128.8 584.3,135.3 
		577.3,135.3 582.9,139.4 	"/>
	<polygon class="st2" points="565.2,108 563.1,114.6 556,114.6 561.8,118.6 559.6,125 565.2,121 570.9,125 568.7,118.6 574.4,114.6 
		567.4,114.6 	"/>
	<polygon class="st3" points="177.2,122.1 195.3,122.1 195.3,125 180.6,125 180.6,136.9 193.1,136.9 193.1,139.8 180.6,139.8 
		180.6,152.3 177.2,152.3 	"/>
	<path class="st3" d="M215.8,130.5v21.8h-3.3v-1.6c0,0-3.3,2-6.4,2c-6.1,0-7.3-2.8-7.3-10.9v-11.4h3.3v11.4c0,6.1,0.5,8,4.5,8
		c3.3,0,5.9-1.6,5.9-1.6v-17.8L215.8,130.5L215.8,130.5z"/>
	<path class="st3" d="M222,152.3v-21.8h3.3v1.6c0,0,3.6-2,6.7-2c6.1,0,7.3,3,7.3,10.8v11.5H236v-11.4c0-5.8-0.6-8-4.7-8
		c-3.1,0-6.1,1.6-6.1,1.6v17.8L222,152.3L222,152.3z"/>
	<path class="st3" d="M262.2,152.3H259v-1.6c0,0-3.4,1.9-6.7,1.9c-4.2,0-7.8-1.7-7.8-11.2c0-7.6,2.5-11.5,9.2-11.5
		c1.9,0,4.7,0.5,5.3,0.6v-9.7h3.3V152.3z M259.1,148.3v-14.8c-0.6-0.2-3.4-0.5-5.1-0.5c-4.5,0-5.9,3-5.9,8.7c0,7,2.3,8.3,4.8,8.3
		C255.9,149.8,259.1,148.3,259.1,148.3"/>
	<path class="st3" d="M284.7,149.5l0.2,2.7c0,0-5,0.6-8.6,0.6c-6.6,0-8.6-3.7-8.6-11.2c0-8.3,3.6-11.5,9.2-11.5
		c5.8,0,8.7,3.1,8.7,10.3l-0.2,2.5h-14.4c0,4.7,1.4,7.2,5.8,7.2C280,149.8,284.7,149.5,284.7,149.5 M282.4,140.2
		c0-5.5-1.7-7.3-5.5-7.3c-3.7,0-5.8,2-5.9,7.3H282.4z"/>
	<path class="st3" d="M307.5,152.3h-3.3v-1.6c0,0-3.4,1.9-6.7,1.9c-4.2,0-7.8-1.7-7.8-11.2c0-7.6,2.5-11.5,9.2-11.5
		c1.9,0,4.7,0.5,5.3,0.6v-9.7h3.3V152.3z M304.2,148.3v-14.8c-0.6-0.2-3.4-0.5-5.1-0.5c-4.5,0-5.9,3-5.9,8.7c0,7,2.3,8.3,4.8,8.3
		C301.1,149.8,304.2,148.3,304.2,148.3"/>
	<path class="st3" d="M341,141.1c0,8.7-2.3,11.7-10.3,11.7c-2.7,0-7.3-0.5-7.3-0.5V121h3.3v10.6c0,0,3.3-1.6,6.4-1.6
		C339,130,341,133.1,341,141.1 M337.8,141.1c0-5.6-1.1-8.1-5-8.1c-3,0-6.1,1.2-6.1,1.2v15.4c0,0,2.8,0.2,4.1,0.2
		C336.7,149.8,337.8,147.2,337.8,141.1"/>
	<polygon class="st3" points="347.3,130.5 352.7,149.5 354.1,149.5 359.6,130.5 362.9,130.5 353.8,162 350.6,162 353.4,152.3 
		350.1,152.3 344,130.5 	"/>
	<path class="st3" d="M8.6,191.2v10.5c0,4.8,0.3,6.1,3.1,6.1c1.2,0,3.9-0.3,3.9-0.3l0.2,2.7c0,0-3,0.5-4.5,0.5c-4.5,0-6.1-1.7-6.1-8
		V191H2v-2.8h3.1v-6.7h3.3v6.7h7v2.8H8.6V191.2z"/>
	<path class="st3" d="M19.5,210.2v-31.4h3.3v10.8c0,0,3.4-1.7,6.7-1.7c5.9,0,7.3,3,7.3,10.8v11.5h-3.3v-11.4c0-5.8-0.6-8-4.7-8
		c-3.1,0-6.1,1.2-6.1,1.2v18.1L19.5,210.2L19.5,210.2z"/>
	<path class="st3" d="M59.1,207.3l0.2,2.7c0,0-5,0.6-8.6,0.6c-6.6,0-8.6-3.7-8.6-11.2c0-8.3,3.6-11.5,9.2-11.5
		c5.8,0,8.7,3.1,8.7,10.3l-0.2,2.5H45.5c0,4.7,1.4,7.2,5.8,7.2C54.3,207.7,59.1,207.3,59.1,207.3 M56.6,197.9c0-5.5-1.7-7.3-5.5-7.3
		c-3.7,0-5.8,2-5.9,7.3H56.6z"/>
	<polygon class="st3" points="75.2,179.9 93.6,179.9 93.6,182.9 78.6,182.9 78.6,193.4 90.9,193.4 90.9,196.3 78.6,196.3 
		78.6,207.3 93.6,207.3 93.6,210.2 75.2,210.2 	"/>
	<path class="st3" d="M115.3,188.4v21.8H112v-1.6c0,0-3.3,2-6.4,2c-6.1,0-7.3-2.8-7.3-10.9v-11.4h3.3v11.4c0,6.1,0.5,8,4.5,8
		c3.3,0,5.9-1.6,5.9-1.6v-17.8L115.3,188.4L115.3,188.4z"/>
	<path class="st3" d="M121.7,188.4h3.3v3c0,0,3.7-2.7,8-3.4v3.3c-4.1,0.8-8,3-8,3v16.1h-3.3V188.4z"/>
	<path class="st3" d="M154,199c0,8-2,11.5-9.4,11.5s-9.4-3.7-9.4-11.5c0-7.5,2.5-11.1,9.4-11.1C151.6,187.9,154,191.5,154,199
		 M150.7,199c0-6.1-1.2-8.3-5.9-8.3c-4.7,0-5.9,2.2-5.9,8.3c0,6.2,0.8,8.7,5.9,8.7S150.7,205.2,150.7,199"/>
	<path class="st3" d="M159.4,188.4h3.3v1.6c0,0,3.3-2,6.6-2c5.5,0,8,3.4,8,11.1c0,8.6-2.8,11.5-9.5,11.5c-2,0-4.2-0.3-4.8-0.5v9.7
		h-3.3v-31.4H159.4z M162.7,192.6v14.7c0.6,0.2,2.8,0.5,4.7,0.5c4.8,0,6.4-2.5,6.4-8.7c0-5.9-1.9-8.1-5-8.1
		C165.7,190.9,162.7,192.6,162.7,192.6"/>
	<path class="st3" d="M198.6,207.3l0.2,2.7c0,0-5,0.6-8.6,0.6c-6.6,0-8.6-3.7-8.6-11.2c0-8.3,3.6-11.5,9.2-11.5
		c5.8,0,8.7,3.1,8.7,10.3l-0.2,2.5H185c0,4.7,1.4,7.2,5.8,7.2C193.8,207.7,198.6,207.3,198.6,207.3 M196.1,197.9
		c0-5.5-1.7-7.3-5.5-7.3s-5.8,2-5.9,7.3H196.1z"/>
	<path class="st3" d="M219.8,206.2c0.2,1.2,1.1,1.7,2.5,1.9l-0.2,2.7c-2.3,0-3.9-0.5-5.1-1.7c0,0-3.9,1.7-7.8,1.7
		c-3.9,0-6.1-2.3-6.1-6.7c0-4.2,2.2-6.1,6.7-6.4l6.9-0.6v-1.9c0-3.1-1.2-4.2-3.9-4.2c-3.1,0-8.3,0.6-8.3,0.6l-0.2-2.5
		c0,0,4.8-0.9,8.6-0.9c5,0,7,2.3,7,7v11.1H219.8z M210.1,199.9c-2.7,0.3-3.7,1.6-3.7,3.9c0,2.5,1.1,4.1,3.3,4.1
		c3.3,0,6.9-1.4,6.9-1.4v-7.2L210.1,199.9z"/>
	<path class="st3" d="M226.4,210.2v-21.8h3.3v1.6c0,0,3.6-2,6.7-2c6.1,0,7.3,3,7.3,10.8v11.5h-3.3v-11.4c0-5.8-0.6-8-4.7-8
		c-3.1,0-6.1,1.6-6.1,1.6v17.8L226.4,210.2L226.4,210.2z"/>
	<path class="st3" d="M270.2,207.6c4.7,0,7.3-1.9,7.3-6.6v-21.2h3.3V201c0,6.9-3.7,9.7-10.8,9.7c-6.7,0-10.5-2.7-10.5-9.7v-21.1h3.4
		V201C263.2,205.8,265.7,207.6,270.2,207.6"/>
	<path class="st3" d="M287.5,210.2v-21.8h3.3v1.6c0,0,3.6-2,6.7-2c6.1,0,7.3,3,7.3,10.8v11.5h-3.3v-11.4c0-5.8-0.6-8-4.7-8
		c-3.1,0-6.1,1.6-6.1,1.6v17.8L287.5,210.2L287.5,210.2z"/>
	<path class="st3" d="M311.1,179.6h3.3v3.7h-3.3V179.6z M311.1,188.4h3.3v21.8h-3.3V188.4z"/>
	<path class="st3" d="M338.4,199c0,8-2,11.5-9.4,11.5c-7.3,0-9.4-3.7-9.4-11.5c0-7.5,2.5-11.1,9.4-11.1
		C335.9,187.9,338.4,191.5,338.4,199 M335,199c0-6.1-1.2-8.3-5.9-8.3c-4.7,0-5.9,2.2-5.9,8.3c0,6.2,0.8,8.7,5.9,8.7
		C334.2,207.7,335,205.2,335,199"/>
	<path class="st3" d="M343.7,210.2v-21.8h3.3v1.6c0,0,3.6-2,6.7-2c6.1,0,7.3,3,7.3,10.8v11.5h-3.3v-11.4c0-5.8-0.6-8-4.7-8
		c-3.1,0-6.1,1.6-6.1,1.6v17.8L343.7,210.2L343.7,210.2z"/>
</g>
</svg>
