<?xml version="1.0" encoding="utf-8"?>
<!-- Generator: Adobe Illustrator 22.0.1, SVG Export Plug-In . SVG Version: 6.00 Build 0)  -->
<svg version="1.1" id="Layer_1" xmlns="http://www.w3.org/2000/svg" xmlns:xlink="http://www.w3.org/1999/xlink" x="0px" y="0px"
	 viewBox="0 0 670 360" style="enable-background:new 0 0 670 360;" xml:space="preserve">
<style type="text/css">
	.st0{fill:#FFFFFF;}
	.st1{fill-rule:evenodd;clip-rule:evenodd;fill:#FFFFFF;}
	.st2{fill:#164194;}
	.st3{fill:#FFED00;}
</style>
<g>
	<path class="st0" d="M396.4,233.1c-3.7,0-5.9-2.3-5.9-6.4v-7.9c0-5.8,3.6-6.4,8.5-6.4h1.9c4.3,0,5.6,1.8,5.6,5.9v0.6h-2.3v-0.6
		c0-2.9-0.6-3.9-3.6-3.9h-1.3c-4.8,0-6.5,0.6-6.5,4.3v5.6c0,4.6,0.2,6.7,4.1,6.7h2.7c3.7,0,4.8-0.5,4.8-3.4V226h2.3v1.9
		c0,4.7-3,5.2-7.1,5.2H396.4z"/>
	<path class="st0" d="M415.1,218.5c5.3,0,6.3,1.3,6.3,7.3c0,6-1,7.3-6.3,7.3c-5.3,0-6.3-1.3-6.3-7.3
		C408.7,219.8,409.8,218.5,415.1,218.5 M415.1,231.3c3.8,0,4.1-0.6,4.1-5.5c0-5-0.3-5.6-4.1-5.6c-3.8,0-4.1,0.6-4.1,5.6
		C411,230.7,411.2,231.3,415.1,231.3"/>
	<path class="st0" d="M426.8,220.4L426.8,220.4c0.7-1.7,2.8-1.9,4.5-1.9c3.7,0,5.4,1,5.4,4.9v9.5h-2.1v-9.6c0-2.6-1-3-3.4-3
		c-3.5,0-4.3,1.1-4.3,4.4v8.3h-2.1v-14.3h2.1V220.4z"/>
	<path class="st0" d="M442.6,220.4L442.6,220.4c0.7-1.7,2.8-1.9,4.5-1.9c3.7,0,5.4,1,5.4,4.9v9.5h-2.1v-9.6c0-2.6-1-3-3.4-3
		c-3.5,0-4.3,1.1-4.3,4.4v8.3h-2.1v-14.3h2.1V220.4z"/>
	<path class="st0" d="M468.2,228.6v0.5c0,3.8-2.9,4-6.1,4c-5.6,0-6.4-1.8-6.4-7.3c0-5.9,1.3-7.3,6.4-7.3c4.6,0,6.1,1.1,6.1,6.3v1.4
		H458c0,4.5,0.3,5.1,4.2,5.1c2.9,0,3.9-0.2,3.9-2.2v-0.5H468.2z M466,224.5c-0.1-4-0.6-4.3-3.9-4.3c-3.9,0-4,1-4.2,4.3H466z"/>
	<path class="st0" d="M483.4,227.8v0.8c0,4-2.7,4.5-6.1,4.5c-5.9,0-6.3-2.3-6.3-7.6c0-4.6,0.8-7,6-7c3.4,0,6.2,0.4,6.2,4.4v0.4H481
		v-0.4c0-2.6-1.4-2.6-3.9-2.6c-3.8,0-3.9,1.3-3.9,5.9c0,4,0.2,5.2,4.3,5.2c2.7,0,3.7-0.3,3.7-2.9v-0.7H483.4z"/>
	<path class="st0" d="M493.9,220.4h-5.5v9c0,1.5,0.4,1.9,2,1.9c2,0,2-1.1,2-2.4v-1.1h2v1.1c0,2.8-1.2,4.2-4.1,4.2
		c-3.3,0-4.1-0.9-4.1-4.3v-8.4h-1.9v-1.7h1.9v-3.5h2.1v3.5h5.5V220.4z"/>
	<path class="st0" d="M498.5,214.9h-2.1v-2.4h2.1V214.9z M498.5,232.9h-2.1v-14.3h2.1V232.9z"/>
	<path class="st0" d="M504.3,220.4L504.3,220.4c0.7-1.7,2.8-1.9,4.5-1.9c3.7,0,5.4,1,5.4,4.9v9.5H512v-9.6c0-2.6-1-3-3.4-3
		c-3.5,0-4.3,1.1-4.3,4.4v8.3h-2.1v-14.3h2.1V220.4z"/>
	<path class="st0" d="M529.9,234.6c0,3.8-2.8,4.6-6.3,4.6c-3.3,0-5.9-0.5-5.7-4.6h2.2c0,2.7,1.3,2.9,3.6,2.9c2.6,0,4.1-0.3,4.1-3.1
		v-3.3h-0.1c-0.6,1.7-2.9,1.9-4.6,1.9c-4.6,0-5.6-2.4-5.6-7.3c0-4.8,0.7-7.3,5.6-7.3c2,0,3.8,0.3,4.6,2l0.1,0v-1.8h2.1V234.6z
		 M527.7,225.8c0-4-0.3-5.6-4.1-5.6c-4,0-3.9,1.8-3.9,5.6c0,3.4-0.2,5.5,3.9,5.5C527.7,231.3,527.7,229,527.7,225.8"/>
	<path class="st0" d="M545,220.9L545,220.9c0.8-1.8,3-2.4,4.8-2.4c1.7,0,3.9,0.5,4.4,2.4c1-1.9,3.2-2.4,5.1-2.4c3.7,0,4.9,1.5,4.9,5
		v9.4H562v-9.2c0-2.4-0.4-3.5-3.1-3.5c-3,0-4.3,0.9-4.3,3.9v8.7h-2.1v-9.6c-0.1-1.9-0.1-3.1-3.2-3.1c-2.8,0-4.3,1.2-4.3,4.1v8.6
		h-2.1v-14.3h2.1V220.9z"/>
	<path class="st0" d="M577.5,232.9v-1.5l-0.1-0.1c-0.8,1.6-2.9,1.7-4.7,1.7c-3.2,0-5.4-0.6-5.4-4.3c0-3.9,2-4.5,5.6-4.5
		c1.4,0,4.2,0.1,4.5,1.4h0.1v-2.6c0-2.6-1.4-2.9-3.8-2.9c-1.7,0-3.7,0-3.7,2v0.5h-2.2v-0.3c0-3.7,2.5-3.9,5.7-3.9
		c3.6,0,6.2,0.4,6.2,4.7v9.7H577.5z M577.5,228.7c0-2.7-1.6-2.7-4.3-2.7c-2.6,0-3.6,0.2-3.6,2.5c0,2.7,1.1,2.9,3.6,2.9
		C575.3,231.3,577.5,231.3,577.5,228.7"/>
	<path class="st0" d="M590.9,220.4h-5.5v9c0,1.5,0.4,1.9,2,1.9c2,0,2-1.1,2-2.4v-1.1h2v1.1c0,2.8-1.2,4.2-4.1,4.2
		c-3.3,0-4.1-0.9-4.1-4.3v-8.4h-1.9v-1.7h1.9v-3.5h2.1v3.5h5.5V220.4z"/>
	<path class="st0" d="M600.8,220.4h-5.5v9c0,1.5,0.4,1.9,2,1.9c2,0,2-1.1,2-2.4v-1.1h2v1.1c0,2.8-1.2,4.2-4.1,4.2
		c-3.3,0-4.1-0.9-4.1-4.3v-8.4h-1.9v-1.7h1.9v-3.5h2.1v3.5h5.5V220.4z"/>
	<path class="st0" d="M615.3,228.6v0.5c0,3.8-2.9,4-6.1,4c-5.6,0-6.4-1.8-6.4-7.3c0-5.9,1.3-7.3,6.4-7.3c4.6,0,6.1,1.1,6.1,6.3v1.4
		H605c0,4.5,0.3,5.1,4.2,5.1c2.9,0,3.9-0.2,3.9-2.2v-0.5H615.3z M613,224.5c-0.1-4-0.6-4.3-3.9-4.3c-3.9,0-4,1-4.2,4.3H613z"/>
	<path class="st0" d="M620.4,218.7l-0.1,1.8l0.1,0.1c0.7-1.6,2.4-2,4-2c2.7,0,4,1.4,4,4v1h-2v-0.9c0-1.8-0.6-2.4-2.4-2.4
		c-2.7,0-3.5,1.3-3.5,3.8v8.9h-2.1v-14.3H620.4z"/>
	<path class="st0" d="M641.9,222.4h-2.2v-0.5c0-1.4-1.1-1.4-3.3-1.4c-2.7,0-4,0-4,1.7c0,2.6,0.7,2.4,2.9,2.5c3.7,0.2,7-0.4,7,4.3
		c0,4-2.8,4.2-5.9,4.2c-3.1,0-6.3-0.2-6.3-3.3v-1.3h2.2v1.1c0,1.4,0.8,1.7,4.1,1.7c1.5,0,3.7,0.3,3.7-2.2c0-2.7-1.1-2.2-3.7-2.3
		c-3.1-0.2-6.2,0.1-6.2-3.9c0-4.1,2.4-4.2,6.2-4.2c2.5,0,5.6,0.1,5.6,3.3V222.4z"/>
	<rect x="115.6" y="138.6" class="st0" width="4.8" height="4.8"/>
	<rect x="115.6" y="148" class="st0" width="4.8" height="37.8"/>
	<path class="st1" d="M129.8,138.6h4.8v9.5h18.8v4.7h-18.8v23.6c0,2.6,2,4.8,4.7,4.8h14.2v4.7h-14.2c-4.9,0-9.5-4-9.5-9.5v-23.6
		h-7.1V148h7.1V138.6z"/>
	<path class="st0" d="M105.6,162.2H74c0.1-3.5,1-5.9,2.6-7.2c1.1-1,2.5-1.6,4.6-1.9c1.9-0.5,4.8-0.6,8.6-0.6c3.7,0,6.6,0.1,8.6,0.6
		c1.9,0.4,3.5,1,4.6,1.9C104.7,156.3,105.6,158.7,105.6,162.2 M74,167H111c0-4.2-0.2-7.3-0.7-9.4c-0.5-2-1.3-3.8-2.5-5.4
		c-1.6-1.8-3.5-3.1-6-3.7c-2.4-0.6-6.5-1-12-1c-5.6,0-9.6,0.4-12.1,1c-2.5,0.6-4.4,1.9-5.9,3.7c-1.3,1.6-2.2,3.4-2.5,5.4
		c-0.5,2-0.7,5.2-0.8,9.4c0.1,4.1,0.4,7.2,0.8,9.2c0.4,2,1.2,3.8,2.5,5.4c1.4,1.8,3.4,3.1,5.9,3.7c2.5,0.7,6.5,1,12.1,1
		c5.5,0,9.6-0.2,12-1c2.5-0.6,4.4-1.9,6-3.7c1-1.2,1.7-2.6,2.2-4.1h-5.6c-0.4,0.5-0.7,1-1.2,1.4c-1.1,0.8-2.6,1.6-4.6,1.9
		c-2,0.4-4.9,0.5-8.6,0.5c-3.8,0-6.7-0.1-8.6-0.5c-2-0.4-3.5-1.1-4.6-1.9c-1.4-1.2-2.3-3.2-2.5-6C74,171.1,74,168.9,74,167"/>
	<path class="st1" d="M111,252c46.9,0,85-38,85-85c0-47.1-38.1-85.1-85-85.1c-15.5,0-30,4.1-42.5,11.4l4.7,8.2
		c11.2-6.5,24-10.1,37.8-10.1c41.7,0,75.6,33.8,75.6,75.6c0,41.6-33.8,75.6-75.6,75.6s-75.6-34-75.6-75.6h-9.5
		C25.9,213.9,64.1,252,111,252"/>
	<path class="st1" d="M111,233.1c24.5,0,45.8-13.3,57.2-33.1l-8.2-4.7c-9.8,16.9-28.1,28.3-49.1,28.3c-31.3,0-56.6-25.4-56.6-56.7
		c0-31.3,25.3-56.8,56.6-56.8c21,0,39.2,11.4,49.1,28.3l8.2-4.7c-11.4-19.8-32.7-33.1-57.2-33.1c-36.5,0-66.1,29.6-66.1,66.3
		C44.9,203.5,74.5,233.1,111,233.1"/>
	<path class="st0" d="M609.7,176.7h4.4v0.7c0,1.4,0.1,2.4,0.5,3c0.2,0.6,0.8,1.1,1.8,1.4c1.2,0.5,4.6,0.6,10.3,0.6
		c3.6,0,6,0,7.4-0.2c1.4-0.1,2.4-0.4,3-0.8c0.8-0.7,1.2-1.7,1.2-3c0-1.6-0.5-2.6-1.4-3.2c-1-0.5-2.9-0.8-5.4-0.8
		c-0.8,0-4.9,0-12-0.1c-1.9,0-3.4-0.1-4.6-0.5c-1.1-0.2-2-0.6-2.8-1.2c-1.4-1.1-2-2.9-2-5.5c0-2.8,0.8-4.7,2.6-6
		c0.8-0.6,2.4-1.1,4.4-1.3c2.2-0.4,5.2-0.5,9.1-0.5c4.4,0,7.7,0.2,9.7,0.7c2.2,0.5,3.7,1.3,4.7,2.6c0.5,0.5,0.7,1.2,1,1.8
		c0.1,0.7,0.1,1.8,0.1,3.4h-4.3c0-1.7-0.4-2.6-0.8-3.2c-0.6-0.5-1.7-1-3.4-1.2c-1.6-0.2-4-0.4-7.1-0.4c-5.6,0-9.1,0.4-10.3,1.2
		c-1,0.6-1.3,1.6-1.3,3c0,1.4,0.5,2.4,1.4,2.8c1.1,0.5,3.1,0.7,6.4,0.6c3,0,7.1,0.1,12,0.2c3,0.1,5.2,0.8,6.5,2
		c1.3,1.2,1.9,3.1,1.9,5.6c0,1.6-0.2,2.9-0.6,3.8c-0.5,1-1.2,1.8-2.3,2.4c-1,0.6-2.4,1-4.4,1.2c-2,0.2-5,0.4-8.9,0.4
		c-4.3,0-7.6-0.1-9.7-0.4c-2-0.4-3.6-0.7-4.6-1.4c-1-0.6-1.7-1.4-2-2.4c-0.5-1-0.6-2.3-0.6-4V176.7z M601.6,185.8h4.1V148h-4.1
		V185.8z M580.8,173.8c-3.4,0-5.8,0.1-7.1,0.2c-1.4,0.1-2.4,0.4-3,0.6c-1.1,0.7-1.6,1.9-1.6,3.6c0,1.7,0.6,2.9,1.9,3.5
		c1.1,0.5,4.6,0.7,10.6,0.7c4.4,0,7.4-0.2,8.8-0.8c1.4-0.6,2.2-1.7,2.2-3.5c0-1.7-0.7-2.8-2.4-3.4
		C588.6,174.2,585.5,173.8,580.8,173.8 M570.2,167.5h-4.3c-0.1-0.5-0.1-0.8-0.1-1.2c0-2.6,1.1-4.6,3.1-5.5c2-1.1,6-1.6,11.6-1.6
		c4.4,0,7.7,0.2,9.6,0.6c2,0.5,3.5,1.2,4.7,2.4c0.8,0.8,1.4,1.9,1.8,3.2c0.2,1.2,0.4,3.5,0.4,6.6v13.8h-4.1v-3.1h-0.2
		c-1,1.4-2.2,2.4-3.7,2.9c-1.4,0.4-4.1,0.6-8.2,0.6c-4.6,0-7.8-0.1-9.6-0.4c-1.8-0.2-3.1-0.7-4.1-1.3c-0.8-0.7-1.6-1.6-1.9-2.4
		c-0.4-1-0.5-2.3-0.5-4c0-1.9,0.2-3.5,0.8-4.7c0.5-1.1,1.4-1.8,2.8-2.4c1.3-0.6,4.7-1,9.7-1c5.4,0,9,0.2,10.7,0.6
		c1.6,0.2,2.9,1.1,3.8,2.3h0.4v-2.9c0-2.3-0.5-4-1.3-4.9c-0.7-1-1.8-1.6-3.4-1.8c-1.4-0.4-4-0.5-7.3-0.5c-4.6,0-7.4,0.2-8.8,0.7
		c-1.3,0.6-1.9,1.7-1.9,3.5V167.5z M556.8,153h4.1V148h-4.1V153z M556.8,185.8h4.1v-26.3h-4.1V185.8z M525.8,185.8h4.1v-12.1
		c0-4.6,0.7-7.6,2.2-8.9c1.4-1.3,4.6-1.9,9.6-1.9c3.4,0,5.5,0.5,6.6,1.4c0.5,0.5,0.8,1.1,1,1.8c0.2,0.8,0.4,1.9,0.4,3.4v1.9h4.2
		v-2.8c0-3.5-0.8-5.9-2.6-7.4c-0.8-0.7-1.9-1.3-3.2-1.6c-1.2-0.2-3.2-0.5-5.8-0.5c-2.6,0-4.6,0.1-5.9,0.2c-1.3,0.2-2.3,0.5-3.1,0.8
		c-1.3,0.7-2.3,1.7-3,2.9h-0.2v-3.6h-4.1V185.8z M517.4,170.1c0-2.6-0.7-4.4-2-5.4c-1-0.7-2.2-1.2-3.7-1.4c-1.7-0.2-4-0.4-7.1-0.4
		c-2.6,0-4.8,0.1-6.1,0.4c-1.4,0.2-2.5,0.7-3.4,1.3c-1.3,1-2,2.9-2.3,5.5H517.4z M517.5,177.8h4.3c0,3.1-1.1,5.3-3.2,6.5
		c-2.2,1.3-5.9,1.9-11.2,1.9c-4.4,0-7.8-0.2-10.1-0.5c-2.3-0.4-4-1-5.2-1.8c-2.6-1.9-4-5.6-4-11.2c0-3.8,0.6-6.8,1.7-8.8
		c1.1-1.8,2.6-3.1,4.7-3.7c1.9-0.7,5.4-1.1,10.1-1.1c4.6,0,7.8,0.2,9.8,0.7c1.9,0.5,3.6,1.4,4.8,2.8c1,1.2,1.7,2.5,2,4.1
		c0.4,1.4,0.6,3.7,0.6,6.8h-29.3c0.1,3.4,0.7,5.5,1.9,6.7c0.8,0.8,2,1.4,3.8,1.8c1.7,0.2,4.6,0.4,8.5,0.4c3,0,5.2-0.1,6.5-0.4
		c1.4-0.2,2.4-0.8,3.1-1.6C517.1,180,517.4,179.1,517.5,177.8 M462.4,159.6H456v3.6h6.5v12.7c0,2,0,3.6,0.2,4.7
		c0.2,1,0.6,1.9,1.2,2.6c0.7,1.1,1.9,1.8,3.6,2.3c1.6,0.5,3.7,0.7,6.6,0.7c2.8,0,4.9-0.2,6.5-0.7c1.4-0.6,2.6-1.3,3.5-2.5
		c0.5-0.8,0.8-1.7,1.1-2.8c0.1-1.1,0.2-2.5,0.2-4.6V174h-4.1v1.7c0,1.6-0.1,2.8-0.2,3.4c0,0.7-0.2,1.2-0.6,1.7
		c-0.5,0.7-1.1,1.2-1.9,1.4c-0.8,0.2-2.3,0.4-4.1,0.4c-2,0-3.6-0.1-4.6-0.4c-1.1-0.2-1.8-0.7-2.4-1.3c-0.4-0.6-0.6-1.2-0.7-1.7
		c-0.1-0.6-0.2-2.2-0.2-4.6v-11.4h18.4v-3.6h-18.4v-6.5h-4.1V159.6z M437.8,173.8c-3.4,0-5.8,0.1-7.1,0.2c-1.4,0.1-2.4,0.4-2.9,0.6
		c-1.2,0.7-1.7,1.9-1.7,3.6c0,1.7,0.6,2.9,1.9,3.5c1.1,0.5,4.6,0.7,10.7,0.7c4.3,0,7.3-0.2,8.6-0.8c1.4-0.6,2.2-1.7,2.2-3.5
		c0-1.7-0.7-2.8-2.4-3.4C445.6,174.2,442.5,173.8,437.8,173.8 M427.3,167.5H423c0-0.5-0.1-0.8-0.1-1.2c0-2.6,1.1-4.6,3.1-5.5
		c2-1.1,6-1.6,11.6-1.6c4.4,0,7.7,0.2,9.6,0.6c2,0.5,3.5,1.2,4.7,2.4c0.8,0.8,1.4,1.9,1.8,3.2c0.2,1.2,0.4,3.5,0.4,6.6v13.8H450
		l0.1-3.1h-0.2c-1.1,1.4-2.3,2.4-3.7,2.9c-1.4,0.4-4.2,0.6-8.3,0.6c-4.6,0-7.8-0.1-9.6-0.4c-1.8-0.2-3.1-0.7-4.1-1.3
		c-0.8-0.7-1.6-1.6-1.9-2.4c-0.4-1-0.5-2.3-0.5-4c0-1.9,0.2-3.5,0.8-4.7c0.5-1.1,1.4-1.8,2.8-2.4c1.3-0.6,4.7-1,9.8-1
		c5.4,0,8.9,0.2,10.6,0.6c1.7,0.2,2.9,1.1,3.8,2.3h0.4v-2.9c0-2.3-0.5-4-1.3-4.9c-0.7-1-1.8-1.6-3.4-1.8c-1.4-0.4-4-0.5-7.3-0.5
		c-4.4,0-7.4,0.2-8.8,0.7c-1.3,0.6-1.9,1.7-1.9,3.5V167.5z M356.7,185.8h5v-33.1h2.2l21.4,33.1h4.1l21.1-33.1h2.2v33.1h5V148h-10.2
		l-20.2,32l-20.5-32h-10.1V185.8z M313.6,185.8h6.1l8-22.3h0.4l8.2,22.3h6.1l12.2-26.3h-4.8L339.7,182h-0.4l-8-22.4h-6.6l-7.9,22.4
		h-0.4l-10.1-22.4h-4.7L313.6,185.8z M284.6,173.8c-3.4,0-5.8,0.1-7.2,0.2c-1.3,0.1-2.3,0.4-2.9,0.6c-1.1,0.7-1.7,1.9-1.7,3.6
		c0,1.7,0.7,2.9,2,3.5c1,0.5,4.6,0.7,10.6,0.7c4.4,0,7.3-0.2,8.8-0.8c1.4-0.6,2.2-1.7,2.2-3.5c0-1.7-0.8-2.8-2.4-3.4
		C292.4,174.2,289.3,173.8,284.6,173.8 M273.9,167.5h-4.3v-1.2c0-2.6,1-4.6,3.1-5.5c2-1.1,5.9-1.6,11.6-1.6c4.4,0,7.7,0.2,9.6,0.6
		c1.9,0.5,3.5,1.2,4.6,2.4c1,0.8,1.6,1.9,1.8,3.2c0.4,1.2,0.5,3.5,0.5,6.6v13.8h-4.2l0.1-3.1h-0.2c-1,1.4-2.3,2.4-3.7,2.9
		c-1.4,0.4-4.2,0.6-8.2,0.6c-4.7,0-7.8-0.1-9.6-0.4c-1.8-0.2-3.1-0.7-4.1-1.3c-1-0.7-1.6-1.6-1.9-2.4c-0.4-1-0.6-2.3-0.6-4
		c0-1.9,0.4-3.5,0.8-4.7c0.6-1.1,1.4-1.8,2.8-2.4c1.4-0.6,4.7-1,9.8-1c5.4,0,8.9,0.2,10.6,0.6c1.7,0.2,3,1.1,3.8,2.3h0.4v-2.9
		c0-2.3-0.4-4-1.2-4.9c-0.7-1-1.9-1.6-3.4-1.8c-1.6-0.4-4-0.5-7.4-0.5c-4.4,0-7.3,0.2-8.6,0.7c-1.3,0.6-2,1.7-2,3.5V167.5z
		 M226.8,166.9h18.5c4.9,0,8-0.1,9.5-0.2c1.3-0.1,2.5-0.5,3.4-1c1.3-0.8,1.9-3,1.9-6.4c0-2.8-0.6-4.7-1.8-5.5
		c-0.7-0.5-1.9-0.8-3.6-1.1c-1.7-0.1-4.8-0.2-9.4-0.2h-18.5V166.9z M221.8,185.8V148h23.5c6.4,0.1,10.4,0.2,12.2,0.5
		c3.1,0.4,5.3,1.8,6.5,4.2c0.8,1.6,1.2,3.8,1.2,6.7c0,2.2-0.1,3.8-0.4,5c-0.2,1.1-0.6,2-1.3,2.6c-1,1.1-2.4,1.9-4.6,2.4
		c1.7,0.2,2.9,0.8,3.8,1.8c0.7,0.8,1.2,1.7,1.4,2.8c0.2,1.1,0.4,3.2,0.4,6.4v5.4h-5v-3.6c0-3.1-0.1-5.3-0.2-6.4
		c-0.4-2.4-1.7-3.8-4.1-4.3c-1-0.1-1.8-0.1-2.5-0.1c-0.7-0.1-3.1-0.1-7.4-0.1h-18.5v14.5H221.8z"/>
</g>
<g>
	<rect x="737.9" y="-208.9" class="st2" width="170.1" height="111.6"/>
	<polygon class="st3" points="819.3,-184.6 822.9,-187.2 826.5,-184.6 825.1,-188.8 828.8,-191.3 824.3,-191.3 822.9,-195.5 
		821.5,-191.3 817,-191.3 820.7,-188.8 	"/>
	<polygon class="st3" points="800.7,-179.7 804.3,-182.3 807.9,-179.7 806.5,-183.8 810.2,-186.4 805.7,-186.4 804.3,-190.6 
		802.9,-186.4 798.4,-186.4 802.1,-183.8 	"/>
	<polygon class="st3" points="790.7,-177.2 789.4,-173 784.9,-173 788.5,-170.4 787.1,-166.3 790.7,-168.8 794.3,-166.3 
		792.9,-170.4 796.6,-173 792.1,-173 	"/>
	<polygon class="st3" points="785.7,-150.6 789.3,-148 788,-152.2 791.6,-154.8 787.1,-154.8 785.7,-159 784.4,-154.8 779.9,-154.8 
		783.5,-152.2 782.2,-148 	"/>
	<polygon class="st3" points="792.1,-136.5 790.7,-140.7 789.4,-136.4 784.9,-136.5 788.5,-133.9 787.1,-129.7 790.7,-132.3 
		794.3,-129.7 793,-133.9 796.6,-136.5 	"/>
	<polygon class="st3" points="805.7,-123.1 804.3,-127.3 803,-123 798.5,-123.1 802.1,-120.5 800.8,-116.3 804.3,-118.9 
		807.9,-116.3 806.6,-120.5 810.2,-123.1 	"/>
	<polygon class="st3" points="824.3,-118.2 822.9,-122.4 821.5,-118.2 817,-118.2 820.7,-115.6 819.3,-111.5 822.9,-114 
		826.5,-111.5 825.1,-115.6 828.8,-118.2 	"/>
	<polygon class="st3" points="842.8,-123.1 841.4,-127.3 840.1,-123 835.6,-123.1 839.2,-120.5 837.9,-116.3 841.4,-118.9 
		845,-116.3 843.7,-120.5 847.3,-123.1 	"/>
	<polygon class="st3" points="856.4,-136.5 855.1,-140.7 853.7,-136.4 849.2,-136.5 852.8,-133.9 851.5,-129.7 855.1,-132.3 
		858.6,-129.7 857.3,-133.9 860.9,-136.5 	"/>
	<polygon class="st3" points="865.9,-154.8 861.4,-154.8 860,-159 858.6,-154.8 854.1,-154.8 857.8,-152.2 856.4,-148.1 860,-150.7 
		863.6,-148.1 862.2,-152.2 	"/>
	<polygon class="st3" points="851.5,-166.3 855.1,-168.9 858.7,-166.3 857.3,-170.5 860.9,-173.1 856.4,-173.1 855.1,-177.3 
		853.7,-173.1 849.2,-173.1 852.8,-170.5 	"/>
	<polygon class="st3" points="841.5,-190.6 840.1,-186.4 835.6,-186.4 839.3,-183.8 837.9,-179.7 841.5,-182.3 845.1,-179.7 
		843.7,-183.8 847.4,-186.4 842.9,-186.4 	"/>
	<polygon class="st0" points="592.8,-181.6 604.4,-181.6 604.4,-179.7 595,-179.7 595,-172.1 603,-172.1 603,-170.2 595,-170.2 
		595,-162.2 592.8,-162.2 	"/>
	<path class="st0" d="M617.5-176.2v14h-2.1v-1c0,0-2.1,1.3-4.1,1.3c-3.9,0-4.7-1.8-4.7-7v-7.3h2.1v7.3c0,3.9,0.3,5.1,2.9,5.1
		c2.1,0,3.8-1,3.8-1v-11.4H617.5z"/>
	<path class="st0" d="M621.5-162.2v-14h2.1v1c0,0,2.3-1.3,4.3-1.3c3.9,0,4.7,1.9,4.7,6.9v7.4h-2.1v-7.3c0-3.7-0.4-5.1-3-5.1
		c-2,0-3.9,1-3.9,1v11.4H621.5z"/>
	<path class="st0" d="M647.3-162.2h-2.1v-1c0,0-2.2,1.2-4.3,1.2c-2.7,0-5-1.1-5-7.2c0-4.9,1.6-7.4,5.9-7.4c1.2,0,3,0.3,3.4,0.4v-6.2
		h2.1V-162.2z M645.3-164.8v-9.5c-0.4-0.1-2.2-0.3-3.3-0.3c-2.9,0-3.8,1.9-3.8,5.6c0,4.5,1.5,5.3,3.1,5.3
		C643.2-163.8,645.3-164.8,645.3-164.8"/>
	<path class="st0" d="M661.7-164l0.1,1.7c0,0-3.2,0.4-5.5,0.4c-4.2,0-5.5-2.4-5.5-7.2c0-5.3,2.3-7.4,5.9-7.4c3.7,0,5.6,2,5.6,6.6
		l-0.1,1.6h-9.2c0,3,0.9,4.6,3.7,4.6C658.7-163.8,661.7-164,661.7-164 M660.2-170c0-3.5-1.1-4.7-3.5-4.7c-2.4,0-3.7,1.3-3.8,4.7
		H660.2z"/>
	<path class="st0" d="M676.3-162.2h-2.1v-1c0,0-2.2,1.2-4.3,1.2c-2.7,0-5-1.1-5-7.2c0-4.9,1.6-7.4,5.9-7.4c1.2,0,3,0.3,3.4,0.4v-6.2
		h2.1V-162.2z M674.2-164.8v-9.5c-0.4-0.1-2.2-0.3-3.3-0.3c-2.9,0-3.8,1.9-3.8,5.6c0,4.5,1.5,5.3,3.1,5.3
		C672.2-163.8,674.2-164.8,674.2-164.8"/>
	<path class="st0" d="M697.8-169.4c0,5.6-1.5,7.5-6.6,7.5c-1.7,0-4.7-0.3-4.7-0.3v-20.1h2.1v6.8c0,0,2.1-1,4.1-1
		C696.5-176.5,697.8-174.5,697.8-169.4 M695.7-169.4c0-3.6-0.7-5.2-3.2-5.2c-1.9,0-3.9,0.8-3.9,0.8v9.9c0,0,1.8,0.1,2.6,0.1
		C695-163.8,695.7-165.5,695.7-169.4"/>
	<polygon class="st0" points="701.8,-176.2 705.3,-164 706.2,-164 709.7,-176.2 711.8,-176.2 706,-156 703.9,-156 705.7,-162.2 
		703.6,-162.2 699.7,-176.2 	"/>
	<path class="st0" d="M484.7-137.3v6.7c0,3.1,0.2,3.9,2,3.9c0.8,0,2.5-0.2,2.5-0.2l0.1,1.7c0,0-1.9,0.3-2.9,0.3
		c-2.9,0-3.9-1.1-3.9-5.1v-7.4h-2v-1.8h2v-4.3h2.1v4.3h4.5v1.8H484.7z"/>
	<path class="st0" d="M491.7-125.1v-20.1h2.1v6.9c0,0,2.2-1.1,4.3-1.1c3.8,0,4.7,1.9,4.7,6.9v7.4h-2.1v-7.3c0-3.7-0.4-5.1-3-5.1
		c-2,0-3.9,0.8-3.9,0.8v11.6H491.7z"/>
	<path class="st0" d="M517.1-127l0.1,1.7c0,0-3.2,0.4-5.5,0.4c-4.2,0-5.5-2.4-5.5-7.2c0-5.3,2.3-7.4,5.9-7.4c3.7,0,5.6,2,5.6,6.6
		l-0.1,1.6h-9.2c0,3,0.9,4.6,3.7,4.6C514-126.7,517.1-127,517.1-127 M515.5-133c0-3.5-1.1-4.7-3.5-4.7c-2.4,0-3.7,1.3-3.8,4.7H515.5
		z"/>
	<polygon class="st0" points="527.4,-144.5 539.2,-144.5 539.2,-142.6 529.6,-142.6 529.6,-135.9 537.5,-135.9 537.5,-134 
		529.6,-134 529.6,-127 539.2,-127 539.2,-125.1 527.4,-125.1 	"/>
	<path class="st0" d="M553.1-139.1v14H551v-1c0,0-2.1,1.3-4.1,1.3c-3.9,0-4.7-1.8-4.7-7v-7.3h2.1v7.3c0,3.9,0.3,5.1,2.9,5.1
		c2.1,0,3.8-1,3.8-1v-11.4H553.1z"/>
	<path class="st0" d="M557.2-139.1h2.1v1.9c0,0,2.4-1.7,5.1-2.2v2.1c-2.6,0.5-5.1,1.9-5.1,1.9v10.3h-2.1V-139.1z"/>
	<path class="st0" d="M577.9-132.3c0,5.1-1.3,7.4-6,7.4c-4.7,0-6-2.4-6-7.4c0-4.8,1.6-7.1,6-7.1
		C576.4-139.4,577.9-137.1,577.9-132.3 M575.8-132.3c0-3.9-0.8-5.3-3.8-5.3c-3,0-3.8,1.4-3.8,5.3c0,4,0.5,5.6,3.8,5.6
		C575.3-126.7,575.8-128.3,575.8-132.3"/>
	<path class="st0" d="M581.4-139.1h2.1v1c0,0,2.1-1.3,4.2-1.3c3.5,0,5.1,2.2,5.1,7.1c0,5.5-1.8,7.4-6.1,7.4c-1.3,0-2.7-0.2-3.1-0.3
		v6.2h-2.1V-139.1z M583.5-136.4v9.4c0.4,0.1,1.8,0.3,3,0.3c3.1,0,4.1-1.6,4.1-5.6c0-3.8-1.2-5.2-3.2-5.2
		C585.4-137.5,583.5-136.4,583.5-136.4"/>
	<path class="st0" d="M606.5-127l0.1,1.7c0,0-3.2,0.4-5.5,0.4c-4.2,0-5.5-2.4-5.5-7.2c0-5.3,2.3-7.4,5.9-7.4c3.7,0,5.6,2,5.6,6.6
		l-0.1,1.6h-9.2c0,3,0.9,4.6,3.7,4.6C603.4-126.7,606.5-127,606.5-127 M604.9-133c0-3.5-1.1-4.7-3.5-4.7c-2.4,0-3.7,1.3-3.8,4.7
		H604.9z"/>
	<path class="st0" d="M620.1-127.7c0.1,0.8,0.7,1.1,1.6,1.2l-0.1,1.7c-1.5,0-2.5-0.3-3.3-1.1c0,0-2.5,1.1-5,1.1
		c-2.5,0-3.9-1.5-3.9-4.3c0-2.7,1.4-3.9,4.3-4.1l4.4-0.4v-1.2c0-2-0.8-2.7-2.5-2.7c-2,0-5.3,0.4-5.3,0.4l-0.1-1.6
		c0,0,3.1-0.6,5.5-0.6c3.2,0,4.5,1.5,4.5,4.5V-127.7z M613.9-131.7c-1.7,0.2-2.4,1-2.4,2.5c0,1.6,0.7,2.6,2.1,2.6
		c2.1,0,4.4-0.9,4.4-0.9v-4.6L613.9-131.7z"/>
	<path class="st0" d="M624.3-125.1v-14h2.1v1c0,0,2.3-1.3,4.3-1.3c3.9,0,4.7,1.9,4.7,6.9v7.4h-2.1v-7.3c0-3.7-0.4-5.1-3-5.1
		c-2,0-3.9,1-3.9,1v11.4H624.3z"/>
	<path class="st0" d="M652.4-126.8c3,0,4.7-1.2,4.7-4.2v-13.6h2.1v13.5c0,4.4-2.4,6.2-6.9,6.2c-4.3,0-6.7-1.7-6.7-6.2v-13.5h2.2
		v13.6C647.9-127.9,649.5-126.8,652.4-126.8"/>
	<path class="st0" d="M663.5-125.1v-14h2.1v1c0,0,2.3-1.3,4.3-1.3c3.9,0,4.7,1.9,4.7,6.9v7.4h-2.1v-7.3c0-3.7-0.4-5.1-3-5.1
		c-2,0-3.9,1-3.9,1v11.4H663.5z"/>
	<path class="st0" d="M678.6-144.7h2.1v2.4h-2.1V-144.7z M678.6-139.1h2.1v14h-2.1V-139.1z"/>
	<path class="st0" d="M696.1-132.3c0,5.1-1.3,7.4-6,7.4c-4.7,0-6-2.4-6-7.4c0-4.8,1.6-7.1,6-7.1
		C694.5-139.4,696.1-137.1,696.1-132.3 M693.9-132.3c0-3.9-0.8-5.3-3.8-5.3c-3,0-3.8,1.4-3.8,5.3c0,4,0.5,5.6,3.8,5.6
		C693.4-126.7,693.9-128.3,693.9-132.3"/>
	<path class="st0" d="M699.5-125.1v-14h2.1v1c0,0,2.3-1.3,4.3-1.3c3.9,0,4.7,1.9,4.7,6.9v7.4h-2.1v-7.3c0-3.7-0.4-5.1-3-5.1
		c-2,0-3.9,1-3.9,1v11.4H699.5z"/>
</g>
</svg>
