(footprint Texas_RHH0036C_VQFN-36-1EP_6x6mm_P0.5mm_EP4.4x4.4mm_ThermalVias (version 20221018) (generator kicad-footprint-generator)
  (layer F.Cu)
  (descr "Texas RHH0036C VQFN, 36 Pin (http://www.ti.com/lit/ds/slvsba5d/slvsba5d.pdf#page=37), generated with kicad-footprint-generator ipc_noLead_generator.py")
  (tags "Texas VQFN NoLead")
  (attr smd)
  (fp_text reference REF** (at 0 -4.33) (layer F.SilkS)
    (effects (font (size 1 1) (thickness 0.15)))
  )
  (fp_text value Texas_RHH0036C_VQFN-36-1EP_6x6mm_P0.5mm_EP4.4x4.4mm_ThermalVias (at 0 4.33) (layer F.Fab)
    (effects (font (size 1 1) (thickness 0.15)))
  )
  (fp_line (start 2.385 -3.11) (end 3.11 -3.11)
    (stroke (width 0.12) (type solid)) (layer F.SilkS))
  (fp_line (start 3.11 -3.11) (end 3.11 -2.385)
    (stroke (width 0.12) (type solid)) (layer F.SilkS))
  (fp_line (start -2.385 3.11) (end -3.11 3.11)
    (stroke (width 0.12) (type solid)) (layer F.SilkS))
  (fp_line (start -3.11 3.11) (end -3.11 2.385)
    (stroke (width 0.12) (type solid)) (layer F.SilkS))
  (fp_line (start 2.385 3.11) (end 3.11 3.11)
    (stroke (width 0.12) (type solid)) (layer F.SilkS))
  (fp_line (start 3.11 3.11) (end 3.11 2.385)
    (stroke (width 0.12) (type solid)) (layer F.SilkS))
  (fp_line (start -2.385 -3.11) (end -3.11 -3.11)
    (stroke (width 0.12) (type solid)) (layer F.SilkS))
  (fp_line (start -2 -3) (end 3 -3)
    (stroke (width 0.1) (type solid)) (layer F.Fab))
  (fp_line (start 3 -3) (end 3 3)
    (stroke (width 0.1) (type solid)) (layer F.Fab))
  (fp_line (start 3 3) (end -3 3)
    (stroke (width 0.1) (type solid)) (layer F.Fab))
  (fp_line (start -3 3) (end -3 -2)
    (stroke (width 0.1) (type solid)) (layer F.Fab))
  (fp_line (start -3 -2) (end -2 -3)
    (stroke (width 0.1) (type solid)) (layer F.Fab))
  (fp_line (start -3.63 -3.63) (end -3.63 3.63)
    (stroke (width 0.05) (type solid)) (layer F.CrtYd))
  (fp_line (start -3.63 3.63) (end 3.63 3.63)
    (stroke (width 0.05) (type solid)) (layer F.CrtYd))
  (fp_line (start 3.63 3.63) (end 3.63 -3.63)
    (stroke (width 0.05) (type solid)) (layer F.CrtYd))
  (fp_line (start 3.63 -3.63) (end -3.63 -3.63)
    (stroke (width 0.05) (type solid)) (layer F.CrtYd))
  (pad 1 smd roundrect (at -2.8875 -2) (size 0.975 0.25) (layers F.Cu F.Mask F.Paste) (roundrect_rratio 0.25))
  (pad 2 smd roundrect (at -2.8875 -1.5) (size 0.975 0.25) (layers F.Cu F.Mask F.Paste) (roundrect_rratio 0.25))
  (pad 3 smd roundrect (at -2.8875 -1) (size 0.975 0.25) (layers F.Cu F.Mask F.Paste) (roundrect_rratio 0.25))
  (pad 4 smd roundrect (at -2.8875 -0.5) (size 0.975 0.25) (layers F.Cu F.Mask F.Paste) (roundrect_rratio 0.25))
  (pad 5 smd roundrect (at -2.8875 0) (size 0.975 0.25) (layers F.Cu F.Mask F.Paste) (roundrect_rratio 0.25))
  (pad 6 smd roundrect (at -2.8875 0.5) (size 0.975 0.25) (layers F.Cu F.Mask F.Paste) (roundrect_rratio 0.25))
  (pad 7 smd roundrect (at -2.8875 1) (size 0.975 0.25) (layers F.Cu F.Mask F.Paste) (roundrect_rratio 0.25))
  (pad 8 smd roundrect (at -2.8875 1.5) (size 0.975 0.25) (layers F.Cu F.Mask F.Paste) (roundrect_rratio 0.25))
  (pad 9 smd roundrect (at -2.8875 2) (size 0.975 0.25) (layers F.Cu F.Mask F.Paste) (roundrect_rratio 0.25))
  (pad 10 smd roundrect (at -2 2.8875) (size 0.25 0.975) (layers F.Cu F.Mask F.Paste) (roundrect_rratio 0.25))
  (pad 11 smd roundrect (at -1.5 2.8875) (size 0.25 0.975) (layers F.Cu F.Mask F.Paste) (roundrect_rratio 0.25))
  (pad 12 smd roundrect (at -1 2.8875) (size 0.25 0.975) (layers F.Cu F.Mask F.Paste) (roundrect_rratio 0.25))
  (pad 13 smd roundrect (at -0.5 2.8875) (size 0.25 0.975) (layers F.Cu F.Mask F.Paste) (roundrect_rratio 0.25))
  (pad 14 smd roundrect (at 0 2.8875) (size 0.25 0.975) (layers F.Cu F.Mask F.Paste) (roundrect_rratio 0.25))
  (pad 15 smd roundrect (at 0.5 2.8875) (size 0.25 0.975) (layers F.Cu F.Mask F.Paste) (roundrect_rratio 0.25))
  (pad 16 smd roundrect (at 1 2.8875) (size 0.25 0.975) (layers F.Cu F.Mask F.Paste) (roundrect_rratio 0.25))
  (pad 17 smd roundrect (at 1.5 2.8875) (size 0.25 0.975) (layers F.Cu F.Mask F.Paste) (roundrect_rratio 0.25))
  (pad 18 smd roundrect (at 2 2.8875) (size 0.25 0.975) (layers F.Cu F.Mask F.Paste) (roundrect_rratio 0.25))
  (pad 19 smd roundrect (at 2.8875 2) (size 0.975 0.25) (layers F.Cu F.Mask F.Paste) (roundrect_rratio 0.25))
  (pad 20 smd roundrect (at 2.8875 1.5) (size 0.975 0.25) (layers F.Cu F.Mask F.Paste) (roundrect_rratio 0.25))
  (pad 21 smd roundrect (at 2.8875 1) (size 0.975 0.25) (layers F.Cu F.Mask F.Paste) (roundrect_rratio 0.25))
  (pad 22 smd roundrect (at 2.8875 0.5) (size 0.975 0.25) (layers F.Cu F.Mask F.Paste) (roundrect_rratio 0.25))
  (pad 23 smd roundrect (at 2.8875 0) (size 0.975 0.25) (layers F.Cu F.Mask F.Paste) (roundrect_rratio 0.25))
  (pad 24 smd roundrect (at 2.8875 -0.5) (size 0.975 0.25) (layers F.Cu F.Mask F.Paste) (roundrect_rratio 0.25))
  (pad 25 smd roundrect (at 2.8875 -1) (size 0.975 0.25) (layers F.Cu F.Mask F.Paste) (roundrect_rratio 0.25))
  (pad 26 smd roundrect (at 2.8875 -1.5) (size 0.975 0.25) (layers F.Cu F.Mask F.Paste) (roundrect_rratio 0.25))
  (pad 27 smd roundrect (at 2.8875 -2) (size 0.975 0.25) (layers F.Cu F.Mask F.Paste) (roundrect_rratio 0.25))
  (pad 28 smd roundrect (at 2 -2.8875) (size 0.25 0.975) (layers F.Cu F.Mask F.Paste) (roundrect_rratio 0.25))
  (pad 29 smd roundrect (at 1.5 -2.8875) (size 0.25 0.975) (layers F.Cu F.Mask F.Paste) (roundrect_rratio 0.25))
  (pad 30 smd roundrect (at 1 -2.8875) (size 0.25 0.975) (layers F.Cu F.Mask F.Paste) (roundrect_rratio 0.25))
  (pad 31 smd roundrect (at 0.5 -2.8875) (size 0.25 0.975) (layers F.Cu F.Mask F.Paste) (roundrect_rratio 0.25))
  (pad 32 smd roundrect (at 0 -2.8875) (size 0.25 0.975) (layers F.Cu F.Mask F.Paste) (roundrect_rratio 0.25))
  (pad 33 smd roundrect (at -0.5 -2.8875) (size 0.25 0.975) (layers F.Cu F.Mask F.Paste) (roundrect_rratio 0.25))
  (pad 34 smd roundrect (at -1 -2.8875) (size 0.25 0.975) (layers F.Cu F.Mask F.Paste) (roundrect_rratio 0.25))
  (pad 35 smd roundrect (at -1.5 -2.8875) (size 0.25 0.975) (layers F.Cu F.Mask F.Paste) (roundrect_rratio 0.25))
  (pad 36 smd roundrect (at -2 -2.8875) (size 0.25 0.975) (layers F.Cu F.Mask F.Paste) (roundrect_rratio 0.25))
  (pad 37 smd rect (at 0 0) (size 4.4 4.4) (layers F.Cu F.Mask))
  (pad 37 thru_hole circle (at -1.575 -1.575) (size 0.5 0.5) (drill 0.2) (layers *.Cu))
  (pad 37 thru_hole circle (at -0.525 -1.575) (size 0.5 0.5) (drill 0.2) (layers *.Cu))
  (pad 37 thru_hole circle (at 0.525 -1.575) (size 0.5 0.5) (drill 0.2) (layers *.Cu))
  (pad 37 thru_hole circle (at 1.575 -1.575) (size 0.5 0.5) (drill 0.2) (layers *.Cu))
  (pad 37 thru_hole circle (at -1.575 -0.525) (size 0.5 0.5) (drill 0.2) (layers *.Cu))
  (pad 37 thru_hole circle (at -0.525 -0.525) (size 0.5 0.5) (drill 0.2) (layers *.Cu))
  (pad 37 thru_hole circle (at 0.525 -0.525) (size 0.5 0.5) (drill 0.2) (layers *.Cu))
  (pad 37 thru_hole circle (at 1.575 -0.525) (size 0.5 0.5) (drill 0.2) (layers *.Cu))
  (pad 37 thru_hole circle (at -1.575 0.525) (size 0.5 0.5) (drill 0.2) (layers *.Cu))
  (pad 37 thru_hole circle (at -0.525 0.525) (size 0.5 0.5) (drill 0.2) (layers *.Cu))
  (pad 37 thru_hole circle (at 0.525 0.525) (size 0.5 0.5) (drill 0.2) (layers *.Cu))
  (pad 37 thru_hole circle (at 1.575 0.525) (size 0.5 0.5) (drill 0.2) (layers *.Cu))
  (pad 37 thru_hole circle (at -1.575 1.575) (size 0.5 0.5) (drill 0.2) (layers *.Cu))
  (pad 37 thru_hole circle (at -0.525 1.575) (size 0.5 0.5) (drill 0.2) (layers *.Cu))
  (pad 37 thru_hole circle (at 0.525 1.575) (size 0.5 0.5) (drill 0.2) (layers *.Cu))
  (pad 37 thru_hole circle (at 1.575 1.575) (size 0.5 0.5) (drill 0.2) (layers *.Cu))
  (pad 37 smd rect (at 0 0) (size 3.65 3.65) (layers B.Cu))
  (pad "" smd roundrect (at -1.05 -1.05) (size 0.846537 0.846537) (layers F.Paste) (roundrect_rratio 0.25))
  (pad "" smd roundrect (at -1.05 0) (size 0.846537 0.846537) (layers F.Paste) (roundrect_rratio 0.25))
  (pad "" smd roundrect (at -1.05 1.05) (size 0.846537 0.846537) (layers F.Paste) (roundrect_rratio 0.25))
  (pad "" smd roundrect (at 0 -1.05) (size 0.846537 0.846537) (layers F.Paste) (roundrect_rratio 0.25))
  (pad "" smd roundrect (at 0 0) (size 0.846537 0.846537) (layers F.Paste) (roundrect_rratio 0.25))
  (pad "" smd roundrect (at 0 1.05) (size 0.846537 0.846537) (layers F.Paste) (roundrect_rratio 0.25))
  (pad "" smd roundrect (at 1.05 -1.05) (size 0.846537 0.846537) (layers F.Paste) (roundrect_rratio 0.25))
  (pad "" smd roundrect (at 1.05 0) (size 0.846537 0.846537) (layers F.Paste) (roundrect_rratio 0.25))
  (pad "" smd roundrect (at 1.05 1.05) (size 0.846537 0.846537) (layers F.Paste) (roundrect_rratio 0.25))
  (pad "" smd custom (at -1.8875 -1.05) (size 0.418645 0.418645) (layers F.Paste)
    (options (clearance outline) (anchor circle))
    (primitives
      (gr_poly (pts
         (xy -0.166699 -0.338022) (xy 0.096078 -0.338022) (xy 0.166699 -0.267401) (xy 0.166699 0.267401)
         (xy 0.096078 0.338022) (xy -0.166699 0.338022)) (width 0.170493))
    ))
  (pad "" smd custom (at -1.8875 0) (size 0.418645 0.418645) (layers F.Paste)
    (options (clearance outline) (anchor circle))
    (primitives
      (gr_poly (pts
         (xy -0.166699 -0.338022) (xy 0.096078 -0.338022) (xy 0.166699 -0.267401) (xy 0.166699 0.267401)
         (xy 0.096078 0.338022) (xy -0.166699 0.338022)) (width 0.170493))
    ))
  (pad "" smd custom (at -1.8875 1.05) (size 0.418645 0.418645) (layers F.Paste)
    (options (clearance outline) (anchor circle))
    (primitives
      (gr_poly (pts
         (xy -0.166699 -0.338022) (xy 0.096078 -0.338022) (xy 0.166699 -0.267401) (xy 0.166699 0.267401)
         (xy 0.096078 0.338022) (xy -0.166699 0.338022)) (width 0.170493))
    ))
  (pad "" smd custom (at 1.8875 -1.05) (size 0.418645 0.418645) (layers F.Paste)
    (options (clearance outline) (anchor circle))
    (primitives
      (gr_poly (pts
         (xy -0.166699 -0.267401) (xy -0.096078 -0.338022) (xy 0.166699 -0.338022) (xy 0.166699 0.338022)
         (xy -0.096078 0.338022) (xy -0.166699 0.267401)) (width 0.170493))
    ))
  (pad "" smd custom (at 1.8875 0) (size 0.418645 0.418645) (layers F.Paste)
    (options (clearance outline) (anchor circle))
    (primitives
      (gr_poly (pts
         (xy -0.166699 -0.267401) (xy -0.096078 -0.338022) (xy 0.166699 -0.338022) (xy 0.166699 0.338022)
         (xy -0.096078 0.338022) (xy -0.166699 0.267401)) (width 0.170493))
    ))
  (pad "" smd custom (at 1.8875 1.05) (size 0.418645 0.418645) (layers F.Paste)
    (options (clearance outline) (anchor circle))
    (primitives
      (gr_poly (pts
         (xy -0.166699 -0.267401) (xy -0.096078 -0.338022) (xy 0.166699 -0.338022) (xy 0.166699 0.338022)
         (xy -0.096078 0.338022) (xy -0.166699 0.267401)) (width 0.170493))
    ))
  (pad "" smd custom (at -1.05 -1.8875) (size 0.418645 0.418645) (layers F.Paste)
    (options (clearance outline) (anchor circle))
    (primitives
      (gr_poly (pts
         (xy -0.338022 -0.166699) (xy 0.338022 -0.166699) (xy 0.338022 0.096078) (xy 0.267401 0.166699)
         (xy -0.267401 0.166699) (xy -0.338022 0.096078)) (width 0.170493))
    ))
  (pad "" smd custom (at 0 -1.8875) (size 0.418645 0.418645) (layers F.Paste)
    (options (clearance outline) (anchor circle))
    (primitives
      (gr_poly (pts
         (xy -0.338022 -0.166699) (xy 0.338022 -0.166699) (xy 0.338022 0.096078) (xy 0.267401 0.166699)
         (xy -0.267401 0.166699) (xy -0.338022 0.096078)) (width 0.170493))
    ))
  (pad "" smd custom (at 1.05 -1.8875) (size 0.418645 0.418645) (layers F.Paste)
    (options (clearance outline) (anchor circle))
    (primitives
      (gr_poly (pts
         (xy -0.338022 -0.166699) (xy 0.338022 -0.166699) (xy 0.338022 0.096078) (xy 0.267401 0.166699)
         (xy -0.267401 0.166699) (xy -0.338022 0.096078)) (width 0.170493))
    ))
  (pad "" smd custom (at -1.05 1.8875) (size 0.418645 0.418645) (layers F.Paste)
    (options (clearance outline) (anchor circle))
    (primitives
      (gr_poly (pts
         (xy -0.338022 -0.096078) (xy -0.267401 -0.166699) (xy 0.267401 -0.166699) (xy 0.338022 -0.096078)
         (xy 0.338022 0.166699) (xy -0.338022 0.166699)) (width 0.170493))
    ))
  (pad "" smd custom (at 0 1.8875) (size 0.418645 0.418645) (layers F.Paste)
    (options (clearance outline) (anchor circle))
    (primitives
      (gr_poly (pts
         (xy -0.338022 -0.096078) (xy -0.267401 -0.166699) (xy 0.267401 -0.166699) (xy 0.338022 -0.096078)
         (xy 0.338022 0.166699) (xy -0.338022 0.166699)) (width 0.170493))
    ))
  (pad "" smd custom (at 1.05 1.8875) (size 0.418645 0.418645) (layers F.Paste)
    (options (clearance outline) (anchor circle))
    (primitives
      (gr_poly (pts
         (xy -0.338022 -0.096078) (xy -0.267401 -0.166699) (xy 0.267401 -0.166699) (xy 0.338022 -0.096078)
         (xy 0.338022 0.166699) (xy -0.338022 0.166699)) (width 0.170493))
    ))
  (pad "" smd custom (at -1.8875 -1.8875) (size 0.389528 0.389528) (layers F.Paste)
    (options (clearance outline) (anchor circle))
    (primitives
      (gr_poly (pts
         (xy -0.137582 -0.137582) (xy 0.137582 -0.137582) (xy 0.137582 0.042841) (xy 0.042841 0.137582)
         (xy -0.137582 0.137582)) (width 0.228726))
    ))
  (pad "" smd custom (at -1.8875 1.8875) (size 0.389528 0.389528) (layers F.Paste)
    (options (clearance outline) (anchor circle))
    (primitives
      (gr_poly (pts
         (xy -0.137582 -0.137582) (xy 0.042841 -0.137582) (xy 0.137582 -0.042841) (xy 0.137582 0.137582)
         (xy -0.137582 0.137582)) (width 0.228726))
    ))
  (pad "" smd custom (at 1.8875 -1.8875) (size 0.389528 0.389528) (layers F.Paste)
    (options (clearance outline) (anchor circle))
    (primitives
      (gr_poly (pts
         (xy -0.137582 -0.137582) (xy 0.137582 -0.137582) (xy 0.137582 0.137582) (xy -0.042841 0.137582)
         (xy -0.137582 0.042841)) (width 0.228726))
    ))
  (pad "" smd custom (at 1.8875 1.8875) (size 0.389528 0.389528) (layers F.Paste)
    (options (clearance outline) (anchor circle))
    (primitives
      (gr_poly (pts
         (xy -0.137582 -0.042841) (xy -0.042841 -0.137582) (xy 0.137582 -0.137582) (xy 0.137582 0.137582)
         (xy -0.137582 0.137582)) (width 0.228726))
    ))
  (fp_text user ${REFERENCE} (at 0 0) (layer F.Fab)
    (effects (font (size 1 1) (thickness 0.15)))
  )
  (model ${KICAD7_3DMODEL_DIR}/Package_DFN_QFN.3dshapes/Texas_RHH0036C_VQFN-36-1EP_6x6mm_P0.5mm_EP4.4x4.4mm.wrl
    (offset (xyz 0 0 0))
    (scale (xyz 1 1 1))
    (rotate (xyz 0 0 0))
  )
)
