%FSAX42Y42*%
%MOMM*%
G71*
G01*
G75*
G04 Layer_Physical_Order=1*
G04 Layer_Color=255*
%ADD10R,0.70X0.30*%
%ADD11R,0.60X0.60*%
%ADD12R,0.60X0.60*%
%ADD13R,1.00X1.00*%
%ADD14R,1.00X1.00*%
%ADD15O,0.30X2.10*%
%ADD16O,2.10X0.30*%
%ADD17R,2.15X3.50*%
%ADD18R,2.15X1.10*%
%ADD19R,2.15X1.10*%
%ADD20R,1.10X0.60*%
%ADD21R,1.50X1.20*%
G04:AMPARAMS|DCode=22|XSize=2mm|YSize=2.4mm|CornerRadius=0.2mm|HoleSize=0mm|Usage=FLASHONLY|Rotation=90.000|XOffset=0mm|YOffset=0mm|HoleType=Round|Shape=RoundedRectangle|*
%AMROUNDEDRECTD22*
21,1,2.00,2.00,0,0,90.0*
21,1,1.60,2.40,0,0,90.0*
1,1,0.40,1.00,0.80*
1,1,0.40,1.00,-0.80*
1,1,0.40,-1.00,-0.80*
1,1,0.40,-1.00,0.80*
%
%ADD22ROUNDEDRECTD22*%
%ADD23R,1.30X0.85*%
%ADD24R,0.30X0.80*%
%ADD25R,0.80X0.30*%
%ADD26C,0.30*%
%ADD27C,0.25*%
%ADD28C,0.60*%
%ADD29C,0.50*%
%ADD30C,0.70*%
%ADD31C,1.00*%
%ADD32C,0.40*%
%ADD33C,1.40*%
%ADD34C,0.20*%
%ADD35C,1.10*%
%ADD36C,1.20*%
%ADD37P,1.65X8X202.5*%
%ADD38C,1.60*%
%ADD39P,1.41X8X202.5*%
%ADD40P,1.52X8X202.5*%
G04:AMPARAMS|DCode=41|XSize=1.52mm|YSize=1.78mm|CornerRadius=0mm|HoleSize=0mm|Usage=FLASHONLY|Rotation=180.000|XOffset=0mm|YOffset=0mm|HoleType=Round|Shape=Octagon|*
%AMOCTAGOND41*
4,1,8,0.38,-0.89,-0.38,-0.89,-0.76,-0.51,-0.76,0.51,-0.38,0.89,0.38,0.89,0.76,0.51,0.76,-0.51,0.38,-0.89,0.0*
%
%ADD41OCTAGOND41*%

%ADD42C,2.00*%
%ADD43C,1.00*%
%ADD44C,0.70*%
G36*
X015917Y008586D02*
Y008565D01*
X015915D01*
Y008510D01*
X015810D01*
Y008508D01*
X015755D01*
X015742Y008506D01*
X015732Y008498D01*
X015687Y008453D01*
X015679Y008443D01*
X015679Y008441D01*
X015677Y008430D01*
Y008180D01*
X015670D01*
Y008080D01*
X015870D01*
Y008094D01*
X015900D01*
Y008080D01*
X015915D01*
X015921Y008071D01*
X015951Y008041D01*
X015940Y008013D01*
X015644D01*
X015293Y008364D01*
X015304Y008392D01*
X015305D01*
X015316Y008394D01*
X015318Y008394D01*
X015328Y008402D01*
X015403Y008477D01*
X015411Y008487D01*
X015411Y008489D01*
X015413Y008500D01*
Y008710D01*
X015411Y008723D01*
X015403Y008733D01*
X015303Y008834D01*
Y008970D01*
X015329Y009008D01*
X015350Y009004D01*
X015371Y009008D01*
X015390Y009020D01*
X015394Y009027D01*
X015476D01*
X015917Y008586D01*
D02*
G37*
G36*
X014197Y009327D02*
X014207Y009319D01*
X014207Y009319D01*
X014207Y009319D01*
D01*
X014207Y009319D01*
X014207Y009319D01*
X014220Y009317D01*
X014546D01*
X014801Y009062D01*
X014798Y009032D01*
X014770Y009013D01*
X014735D01*
X014732Y009031D01*
X014720Y009050D01*
X014701Y009062D01*
X014680Y009066D01*
X014659Y009062D01*
X014640Y009050D01*
X014628Y009031D01*
X014624Y009010D01*
X014628Y008989D01*
X014590Y008963D01*
X014411D01*
Y009050D01*
X014408Y009064D01*
X014400Y009075D01*
X014389Y009083D01*
X014375Y009086D01*
X014361Y009083D01*
X014350Y009075D01*
X014339Y009083D01*
X014325Y009086D01*
X014311Y009083D01*
X014300Y009075D01*
X014289Y009083D01*
X014289D01*
X014275Y009086D01*
D01*
D01*
X014275Y009086D01*
D01*
D01*
X014258Y009085D01*
Y009135D01*
X014256Y009146D01*
X014256Y009148D01*
X014254Y009150D01*
X014256Y009160D01*
X014252Y009181D01*
X014240Y009200D01*
X014221Y009212D01*
X014200Y009216D01*
X014179Y009212D01*
X014160Y009200D01*
X014140D01*
X014121Y009212D01*
X014100Y009216D01*
X014081Y009212D01*
X014074Y009218D01*
X014058Y009242D01*
Y009407D01*
X014116D01*
X014197Y009327D01*
D02*
G37*
G36*
X012686Y009140D02*
X012682Y009136D01*
X012679Y009120D01*
Y008960D01*
X012682Y008944D01*
X012691Y008931D01*
X012704Y008922D01*
X012720Y008919D01*
X012854D01*
X013030Y008743D01*
Y008700D01*
D01*
X013030Y008700D01*
Y008700D01*
X013030D01*
X013030Y008683D01*
X012961D01*
Y008700D01*
X012958Y008716D01*
X012949Y008729D01*
X012936Y008738D01*
X012920Y008741D01*
X012720D01*
X012704Y008738D01*
X012691Y008729D01*
X012682Y008716D01*
X012679Y008700D01*
Y008540D01*
X012680Y008538D01*
X012653Y008524D01*
X012629Y008548D01*
X012630Y008550D01*
X012630D01*
X012630Y008550D01*
Y008650D01*
Y008685D01*
X012580D01*
Y008700D01*
X012565D01*
Y008750D01*
X012560D01*
X012542Y008762D01*
X012533Y008773D01*
X012536Y008790D01*
X012532Y008811D01*
X012520Y008830D01*
X012513Y008834D01*
Y009076D01*
X012520Y009080D01*
X012532Y009099D01*
X012536Y009120D01*
X012532Y009141D01*
X012520Y009160D01*
X012522Y009167D01*
X012671D01*
X012686Y009140D01*
D02*
G37*
G36*
X013127Y008979D02*
Y008900D01*
X013095D01*
Y008850D01*
X013065D01*
Y008900D01*
X013030D01*
Y008876D01*
X013002Y008865D01*
X012948Y008919D01*
X012949Y008931D01*
X012958Y008944D01*
X012961Y008960D01*
Y009106D01*
X012988Y009117D01*
X013127Y008979D01*
D02*
G37*
G36*
X009600Y010475D02*
X010381D01*
X010390Y010462D01*
X010397Y010447D01*
X010280Y010330D01*
X010269Y010315D01*
X010262Y010298D01*
X010259Y010280D01*
Y010050D01*
X010235D01*
Y010000D01*
Y009950D01*
X010259D01*
Y009719D01*
X009927Y009387D01*
X009907Y009390D01*
X009881Y009386D01*
X009857Y009376D01*
X009836Y009360D01*
X009835Y009360D01*
X009725D01*
X009724Y009360D01*
X009703Y009376D01*
X009679Y009386D01*
X009653Y009390D01*
X009627Y009386D01*
X009603Y009376D01*
X009582Y009360D01*
X009566Y009339D01*
X009556Y009315D01*
X009552Y009289D01*
X009556Y009263D01*
X009566Y009239D01*
X009582Y009218D01*
X009603Y009202D01*
X009627Y009192D01*
X009653Y009188D01*
X009679Y009192D01*
X009703Y009202D01*
X009724Y009218D01*
X009725Y009218D01*
X009835D01*
X009836Y009218D01*
X009857Y009202D01*
X009881Y009192D01*
X009907Y009188D01*
X009933Y009192D01*
X009957Y009202D01*
X009978Y009218D01*
X009994Y009239D01*
X010004Y009263D01*
X010005Y009265D01*
X010380Y009640D01*
X010391Y009655D01*
X010398Y009672D01*
X010401Y009690D01*
Y010251D01*
X010479Y010329D01*
X010544D01*
Y010279D01*
X010510Y010245D01*
Y010155D01*
X010555Y010110D01*
X010645D01*
X010690Y010155D01*
X010690D01*
D01*
X010710D01*
X010755Y010110D01*
X010843D01*
X010942Y010012D01*
X010952Y010004D01*
X010965Y010002D01*
X011118D01*
X011142Y009986D01*
X011148Y009979D01*
X011144Y009960D01*
X011148Y009939D01*
X011160Y009920D01*
X011179Y009908D01*
X011200Y009904D01*
X011205Y009905D01*
X011245Y009865D01*
X011256Y009857D01*
X011270Y009854D01*
X011875D01*
X011878Y009855D01*
X011930D01*
Y009905D01*
Y009955D01*
Y010025D01*
D01*
Y010025D01*
X011932Y010027D01*
X011970D01*
Y010025D01*
X011970D01*
Y009955D01*
Y009905D01*
Y009855D01*
X012022D01*
X012025Y009854D01*
X012057D01*
X012058Y009849D01*
X012070Y009830D01*
X012089Y009818D01*
X012110Y009814D01*
X012131Y009818D01*
X012150Y009830D01*
X012156Y009840D01*
X012227D01*
Y009730D01*
X012140D01*
Y009683D01*
X012120Y009663D01*
X012080D01*
Y009715D01*
X012028D01*
X012025Y009716D01*
X011995D01*
X011915Y009795D01*
X011904Y009803D01*
X011890Y009806D01*
X011370D01*
X011356Y009803D01*
X011345Y009795D01*
X011240Y009690D01*
X011155D01*
X011110Y009645D01*
X011110D01*
D01*
X011090D01*
X011045Y009690D01*
X010955D01*
X010910Y009645D01*
X010910D01*
D01*
X010890D01*
X010845Y009690D01*
X010755D01*
X010710Y009645D01*
X010710D01*
D01*
X010690D01*
X010645Y009690D01*
X010555D01*
X010510Y009645D01*
Y009555D01*
X010555Y009510D01*
X010645D01*
X010685Y009550D01*
X010715D01*
X010755Y009510D01*
X010845D01*
X010885Y009550D01*
X010915D01*
X010955Y009510D01*
X011045D01*
X011085Y009550D01*
X011115D01*
X011155Y009510D01*
X011245D01*
X011285Y009550D01*
X011315D01*
X011355Y009510D01*
X011385D01*
Y009600D01*
Y009690D01*
X011380D01*
X011368Y009718D01*
X011385Y009734D01*
X011660D01*
Y009730D01*
X011660D01*
Y009630D01*
Y009546D01*
X011640D01*
X011626Y009543D01*
X011615Y009535D01*
X011555Y009475D01*
X011547Y009464D01*
X011544Y009450D01*
Y009395D01*
X011240Y009090D01*
X011155D01*
X011110Y009045D01*
X011110D01*
D01*
X011090D01*
X011045Y009090D01*
X010955D01*
X010910Y009045D01*
X010910D01*
D01*
X010890D01*
X010845Y009090D01*
X010755D01*
X010710Y009045D01*
X010710D01*
D01*
X010690D01*
X010645Y009090D01*
X010555D01*
X010510Y009045D01*
Y008955D01*
X010555Y008910D01*
X010645D01*
X010685Y008950D01*
X010715D01*
X010755Y008910D01*
X010845D01*
X010885Y008950D01*
X010915D01*
X010955Y008910D01*
X011045D01*
X011085Y008950D01*
X011115D01*
X011155Y008910D01*
X011245D01*
X011290Y008955D01*
X011290D01*
D01*
X011310D01*
X011355Y008910D01*
X011385D01*
Y009000D01*
X011415D01*
Y008910D01*
X011430D01*
X011442Y008882D01*
X011435Y008875D01*
X011427Y008864D01*
X011424Y008850D01*
Y008675D01*
X011240Y008490D01*
X011155D01*
X011110Y008445D01*
X011110D01*
D01*
X011090D01*
X011045Y008490D01*
X010955D01*
X010910Y008445D01*
X010910D01*
D01*
X010890D01*
X010845Y008490D01*
X010755D01*
X010710Y008445D01*
X010710D01*
D01*
X010690D01*
X010645Y008490D01*
X010555D01*
X010510Y008445D01*
Y008355D01*
X010555Y008310D01*
X010645D01*
X010685Y008350D01*
X010715D01*
X010755Y008310D01*
X010845D01*
X010885Y008350D01*
X010915D01*
X010955Y008310D01*
X011045D01*
X011085Y008350D01*
X011115D01*
X011155Y008310D01*
X011245D01*
X011290Y008355D01*
X011290D01*
D01*
X011310D01*
X011355Y008310D01*
X011385D01*
Y008400D01*
X011415D01*
Y008310D01*
X011445D01*
X011447Y008312D01*
X011474Y008300D01*
Y008225D01*
X011435Y008186D01*
X011242D01*
X011240Y008190D01*
X011221Y008202D01*
X011200Y008206D01*
X011179Y008202D01*
X011160Y008190D01*
X011148Y008171D01*
X011144Y008150D01*
X011148Y008129D01*
X011110Y008103D01*
X010574D01*
X010410Y008267D01*
Y008300D01*
X010210D01*
Y008283D01*
X010007D01*
X010004Y008299D01*
X009994Y008323D01*
X009978Y008344D01*
X009957Y008360D01*
X009933Y008370D01*
X009907Y008374D01*
X009881Y008370D01*
X009857Y008360D01*
X009836Y008344D01*
X009820Y008323D01*
X009810Y008299D01*
X009806Y008273D01*
X009810Y008247D01*
X009820Y008223D01*
X009829Y008210D01*
X009819Y008189D01*
X009789Y008184D01*
X009743Y008230D01*
X009750Y008247D01*
X009754Y008273D01*
X009750Y008299D01*
X009740Y008323D01*
X009724Y008344D01*
X009703Y008360D01*
X009679Y008370D01*
X009653Y008374D01*
X009627Y008370D01*
X009603Y008360D01*
X009582Y008344D01*
X009566Y008323D01*
X009556Y008299D01*
X009552Y008273D01*
X009556Y008247D01*
X009566Y008223D01*
X009582Y008202D01*
X009603Y008186D01*
X009627Y008176D01*
X009653Y008172D01*
X009679Y008176D01*
X009696Y008183D01*
X009753Y008127D01*
X009763Y008119D01*
X009776Y008117D01*
X009815D01*
X009834Y008092D01*
X009835Y008090D01*
X009820Y008069D01*
X009810Y008045D01*
X009806Y008019D01*
X009810Y007993D01*
X009820Y007969D01*
X009834Y007950D01*
X009827Y007937D01*
X009822Y007929D01*
X009792Y007927D01*
X009743Y007976D01*
X009750Y007993D01*
X009754Y008019D01*
X009750Y008045D01*
X009740Y008069D01*
X009724Y008090D01*
X009703Y008106D01*
X009679Y008116D01*
X009653Y008120D01*
X009627Y008116D01*
X009603Y008106D01*
X009582Y008090D01*
X009566Y008069D01*
X009556Y008045D01*
X009552Y008019D01*
X009556Y007993D01*
X009566Y007969D01*
X009582Y007948D01*
X009603Y007932D01*
X009627Y007922D01*
X009653Y007918D01*
X009679Y007922D01*
X009696Y007929D01*
X009759Y007867D01*
X009769Y007859D01*
X009771Y007859D01*
X009782Y007857D01*
X009818D01*
X009831Y007830D01*
X009820Y007815D01*
X009810Y007791D01*
X009806Y007765D01*
X009810Y007739D01*
X009820Y007715D01*
X009831Y007700D01*
X009820Y007679D01*
X009791Y007674D01*
X009743Y007722D01*
X009750Y007739D01*
X009754Y007765D01*
X009750Y007791D01*
X009740Y007815D01*
X009724Y007836D01*
X009703Y007852D01*
X009679Y007862D01*
X009653Y007866D01*
X009627Y007862D01*
X009603Y007852D01*
X009582Y007836D01*
X009566Y007815D01*
X009556Y007791D01*
X009552Y007765D01*
X009556Y007739D01*
X009566Y007715D01*
X009582Y007694D01*
X009603Y007678D01*
X009627Y007668D01*
X009653Y007664D01*
X009679Y007668D01*
X009696Y007675D01*
X009755Y007617D01*
X009765Y007609D01*
X009767Y007609D01*
X009778Y007607D01*
X009817D01*
X009827Y007593D01*
X009834Y007580D01*
X009820Y007561D01*
X009810Y007537D01*
X009806Y007511D01*
X009810Y007485D01*
X009820Y007461D01*
X009835Y007440D01*
X009834Y007438D01*
X009822Y007421D01*
X009792Y007419D01*
X009743Y007468D01*
X009750Y007485D01*
X009754Y007511D01*
X009750Y007537D01*
X009740Y007561D01*
X009724Y007582D01*
X009703Y007598D01*
X009679Y007608D01*
X009653Y007612D01*
X009627Y007608D01*
X009603Y007598D01*
X009582Y007582D01*
X009566Y007561D01*
X009556Y007537D01*
X009552Y007511D01*
X009556Y007485D01*
X009566Y007461D01*
X009582Y007440D01*
X009603Y007424D01*
X009627Y007414D01*
X009653Y007410D01*
X009679Y007414D01*
X009696Y007421D01*
X009761Y007357D01*
X009771Y007349D01*
X009771Y007349D01*
X009771Y007349D01*
D01*
X009771Y007349D01*
X009771Y007349D01*
X009784Y007347D01*
X010000D01*
X010011Y007349D01*
X010013Y007349D01*
X010023Y007357D01*
X010182Y007515D01*
X010210Y007504D01*
Y007500D01*
X010366D01*
X010367Y007499D01*
X010369Y007499D01*
X010380Y007497D01*
X011517D01*
X011529Y007469D01*
X011415Y007356D01*
X011320D01*
X011306Y007353D01*
X011295Y007345D01*
X011240Y007290D01*
X011155D01*
X011110Y007245D01*
X011110D01*
D01*
X011090D01*
X011045Y007290D01*
X010955D01*
X010910Y007245D01*
X010910D01*
D01*
X010890D01*
X010845Y007290D01*
X010755D01*
X010710Y007245D01*
X010710D01*
D01*
X010690D01*
X010645Y007290D01*
X010555D01*
X010510Y007245D01*
Y007155D01*
X010555Y007110D01*
X010645D01*
X010685Y007150D01*
X010715D01*
X010755Y007110D01*
X010845D01*
X010885Y007150D01*
X010915D01*
X010955Y007110D01*
X011045D01*
X011085Y007150D01*
X011115D01*
X011155Y007110D01*
X011245D01*
X011290Y007155D01*
X011290D01*
D01*
X011310D01*
X011355Y007110D01*
X011385D01*
Y007200D01*
X011415D01*
Y007110D01*
X011400D01*
X011412Y007082D01*
X011175Y006845D01*
X011167Y006834D01*
X011164Y006820D01*
Y006690D01*
X011155D01*
X011110Y006645D01*
X011110D01*
D01*
X011090D01*
X011045Y006690D01*
X010955D01*
X010910Y006645D01*
X010910D01*
D01*
X010890D01*
X010845Y006690D01*
X010755D01*
X010710Y006645D01*
X010710D01*
D01*
X010690D01*
X010645Y006690D01*
X010555D01*
X010510Y006645D01*
Y006555D01*
X010527Y006538D01*
X010515Y006511D01*
X010488D01*
X010421Y006578D01*
Y006980D01*
X010418Y007003D01*
X010409Y007025D01*
X010394Y007044D01*
X010214Y007224D01*
X010195Y007239D01*
X010186Y007242D01*
X010173Y007248D01*
X010150Y007251D01*
X009718D01*
X009511Y007458D01*
Y008799D01*
X009536Y008815D01*
X009554Y008808D01*
X009556Y008807D01*
X009552Y008781D01*
X009556Y008755D01*
X009566Y008731D01*
X009582Y008710D01*
X009603Y008694D01*
X009627Y008684D01*
X009653Y008680D01*
X009679Y008684D01*
X009703Y008694D01*
X009724Y008710D01*
X009740Y008731D01*
X009750Y008755D01*
X009754Y008781D01*
X009750Y008807D01*
X009740Y008831D01*
X009724Y008852D01*
X009703Y008868D01*
X009679Y008878D01*
X009653Y008882D01*
X009627Y008878D01*
X009626Y008880D01*
X009615Y008907D01*
X009644Y008935D01*
X009653Y008934D01*
X009679Y008938D01*
X009695Y008944D01*
X009865D01*
X009881Y008938D01*
X009907Y008934D01*
X009933Y008938D01*
X009957Y008948D01*
X009978Y008964D01*
X009994Y008985D01*
X010004Y009009D01*
X010008Y009035D01*
X010004Y009061D01*
X009994Y009085D01*
X009978Y009106D01*
X009957Y009122D01*
X009933Y009132D01*
X009907Y009136D01*
X009881Y009132D01*
X009865Y009126D01*
X009695D01*
X009679Y009132D01*
X009653Y009136D01*
X009627Y009132D01*
X009609Y009125D01*
X009592Y009123D01*
X009570Y009114D01*
X009551Y009099D01*
X009356Y008904D01*
X009354Y008902D01*
X009325Y008911D01*
Y010200D01*
X009325Y010200D01*
X009329Y010243D01*
X009339Y010285D01*
X009355Y010325D01*
X009378Y010361D01*
X009406Y010394D01*
X009439Y010422D01*
X009475Y010445D01*
X009515Y010461D01*
X009557Y010471D01*
X009600Y010475D01*
X009600Y010475D01*
D02*
G37*
G36*
X013470Y009720D02*
Y009670D01*
X013613D01*
X013842Y009441D01*
Y009370D01*
X013815D01*
Y009320D01*
X013785D01*
Y009370D01*
X013754D01*
X013748Y009378D01*
X013713Y009413D01*
X013703Y009421D01*
X013701Y009421D01*
X013690Y009423D01*
X013530D01*
X013517Y009421D01*
X013507Y009413D01*
X013448Y009355D01*
X013440Y009356D01*
X013424Y009353D01*
X013401Y009372D01*
Y009490D01*
X013397Y009510D01*
X013386Y009526D01*
X013396Y009550D01*
X013430D01*
Y009585D01*
X013380D01*
Y009615D01*
X013430D01*
Y009650D01*
D01*
Y009650D01*
X013430Y009650D01*
Y009650D01*
X013430D01*
X013430D01*
Y009685D01*
X013380D01*
Y009715D01*
X013430D01*
Y009704D01*
X013435Y009727D01*
X013451Y009732D01*
X013470Y009720D01*
D02*
G37*
G36*
X012657Y009857D02*
X012667Y009849D01*
X012669Y009849D01*
X012680Y009847D01*
X013041D01*
X013061Y009831D01*
X013067Y009822D01*
X013062Y009808D01*
X013059Y009790D01*
Y009751D01*
X012950D01*
X012929Y009747D01*
X012926Y009745D01*
X012875D01*
Y009645D01*
X012926D01*
X012929Y009643D01*
X012950Y009639D01*
X013035D01*
Y009590D01*
X013225D01*
D01*
X013225D01*
X013229Y009586D01*
Y009560D01*
X013179Y009550D01*
X013145D01*
Y009485D01*
X013225D01*
Y009504D01*
X013253Y009515D01*
X013299Y009469D01*
Y009372D01*
X013276Y009353D01*
X013260Y009356D01*
X013239Y009352D01*
X013220Y009340D01*
X013209Y009323D01*
X013084D01*
X013033Y009374D01*
X013035Y009390D01*
X013035Y009390D01*
X013115D01*
Y009470D01*
Y009550D01*
X013046D01*
X013046Y009550D01*
Y009550D01*
X013035Y009550D01*
D01*
X013025Y009555D01*
X013014Y009555D01*
X013014Y009555D01*
Y009555D01*
X012875D01*
Y009455D01*
X013014D01*
X013035Y009434D01*
Y009424D01*
X013014Y009393D01*
X013012Y009391D01*
X013011Y009391D01*
X013000Y009393D01*
X012601D01*
X012590Y009410D01*
X012571Y009422D01*
X012550Y009426D01*
X012529Y009422D01*
X012510Y009410D01*
X012498Y009391D01*
X012457Y009400D01*
X012388Y009469D01*
X012390Y009474D01*
X012411Y009478D01*
X012430Y009490D01*
X012436Y009500D01*
X012466Y009503D01*
X012490Y009480D01*
X012501Y009472D01*
X012515Y009469D01*
X012615D01*
Y009455D01*
X012765D01*
Y009550D01*
Y009585D01*
X012690D01*
Y009615D01*
X012765D01*
Y009645D01*
Y009745D01*
X012695D01*
X012690Y009746D01*
X012600D01*
Y009750D01*
X012542D01*
X012491Y009801D01*
Y009921D01*
X012501Y009935D01*
X012508Y009952D01*
X012510Y009965D01*
X012533Y009973D01*
X012539Y009974D01*
X012657Y009857D01*
D02*
G37*
G36*
X016289Y010103D02*
Y009780D01*
X016265D01*
Y009730D01*
Y009680D01*
X016289D01*
Y008910D01*
X016231D01*
X016231Y008910D01*
Y008910D01*
X016230Y008910D01*
X016220D01*
X016210D01*
X016209Y008910D01*
X016209Y008910D01*
Y008910D01*
X016155D01*
Y008840D01*
X016140D01*
Y008825D01*
X016070D01*
Y008770D01*
X016099D01*
X016102Y008767D01*
X016107Y008741D01*
X016097Y008733D01*
X016035Y008672D01*
X016005D01*
X015493Y009183D01*
X015483Y009191D01*
X015481Y009191D01*
X015470Y009193D01*
X015484Y009207D01*
X015646D01*
X015670Y009183D01*
Y009150D01*
X015870D01*
Y009193D01*
X016026Y009349D01*
X016033Y009360D01*
X016036Y009372D01*
X016036Y009372D01*
X016036Y009372D01*
Y009372D01*
Y009406D01*
X016057Y009415D01*
Y009415D01*
X016058Y009415D01*
X016143D01*
X016185Y009457D01*
Y009543D01*
X016171Y009557D01*
Y009680D01*
X016235D01*
Y009730D01*
Y009780D01*
X016171D01*
Y010004D01*
X016183D01*
X016231Y010052D01*
Y010122D01*
X016259Y010133D01*
X016289Y010103D01*
D02*
G37*
G36*
X011917Y008920D02*
X011919Y008909D01*
X011919Y008907D01*
X011927Y008897D01*
X011938Y008885D01*
X011926Y008857D01*
X011865D01*
Y008810D01*
X011950D01*
Y008795D01*
X011965D01*
Y008732D01*
X011991D01*
X012003Y008705D01*
X011966Y008668D01*
X011865D01*
Y008543D01*
X012035D01*
Y008572D01*
X012064Y008580D01*
X012070Y008570D01*
X012089Y008558D01*
X012110Y008554D01*
X012131Y008558D01*
X012150Y008570D01*
X012162Y008589D01*
X012164Y008601D01*
X012193Y008610D01*
X012552Y008252D01*
X012562Y008244D01*
X012562Y008244D01*
X012562Y008244D01*
D01*
X012562Y008244D01*
X012562Y008244D01*
X012575Y008242D01*
X013130D01*
Y008225D01*
X013180D01*
Y008195D01*
X013130D01*
Y008190D01*
X013118Y008172D01*
X013107Y008163D01*
X013090Y008166D01*
X013069Y008162D01*
X013050Y008150D01*
X013038Y008131D01*
X013034Y008110D01*
X013038Y008089D01*
X013050Y008070D01*
X013069Y008058D01*
X013090Y008054D01*
X013111Y008058D01*
X013114Y008060D01*
X013130Y008060D01*
Y008060D01*
X013154D01*
X013159Y008048D01*
X013142Y008023D01*
X012543D01*
X012530Y008050D01*
X012545Y008069D01*
X012557Y008099D01*
X012561Y008130D01*
X012557Y008161D01*
X012545Y008191D01*
X012526Y008216D01*
X012501Y008235D01*
X012471Y008247D01*
X012440Y008251D01*
X012409Y008247D01*
X012379Y008235D01*
X012354Y008216D01*
X012335Y008191D01*
X012323Y008161D01*
X012319Y008130D01*
X012323Y008099D01*
X012335Y008069D01*
X012350Y008050D01*
X012337Y008023D01*
X012143D01*
X012130Y008050D01*
X012145Y008069D01*
X012157Y008099D01*
X012161Y008130D01*
X012157Y008161D01*
X012145Y008191D01*
X012126Y008216D01*
X012101Y008235D01*
X012071Y008247D01*
X012040Y008251D01*
X012009Y008247D01*
X011979Y008235D01*
X011954Y008216D01*
X011936Y008191D01*
X011934Y008191D01*
X011883Y008212D01*
X011780Y008315D01*
Y008390D01*
D01*
Y008390D01*
X011780Y008390D01*
Y008410D01*
X011780D01*
Y008550D01*
X011756D01*
Y008638D01*
X011815D01*
Y008762D01*
X011722D01*
X011711Y008790D01*
X011845Y008924D01*
X011875D01*
X011878Y008925D01*
X011917D01*
Y008920D01*
D02*
G37*
G36*
X011980Y007577D02*
X011977Y007573D01*
X011969Y007563D01*
X011969Y007561D01*
X011967Y007550D01*
Y007310D01*
X011967D01*
X011965D01*
X011946Y007310D01*
X011946Y007310D01*
Y007310D01*
X011885D01*
Y007230D01*
Y007150D01*
X011946D01*
X011958Y007138D01*
X011946Y007110D01*
X011879D01*
X011873Y007111D01*
X011867Y007110D01*
X011775D01*
Y006950D01*
X011782D01*
Y006766D01*
X011777Y006761D01*
Y006639D01*
X011825Y006591D01*
X011921D01*
X011969Y006639D01*
Y006761D01*
X011964Y006766D01*
Y006950D01*
X011965D01*
Y006954D01*
X012170D01*
X012170Y006954D01*
X012175Y006955D01*
X012297D01*
Y007105D01*
X012175D01*
X012170Y007106D01*
X012033D01*
Y007185D01*
X012043D01*
Y007185D01*
X012165D01*
X012170Y007184D01*
X012662D01*
Y007065D01*
X012670D01*
Y007050D01*
X012670D01*
Y007015D01*
X012720D01*
Y007000D01*
X012735D01*
Y006950D01*
X012759D01*
Y006766D01*
X012754Y006761D01*
Y006639D01*
X012759Y006634D01*
Y006511D01*
X011485D01*
X011473Y006538D01*
X011490Y006555D01*
Y006585D01*
X011400D01*
Y006600D01*
X011385D01*
Y006690D01*
X011355D01*
X011310Y006645D01*
X011310D01*
D01*
X011290D01*
X011245Y006690D01*
X011236D01*
Y006805D01*
X011545Y007115D01*
X011553Y007126D01*
X011556Y007140D01*
X011556Y007140D01*
X011556Y007140D01*
Y007140D01*
Y007285D01*
X011775Y007505D01*
X011791Y007508D01*
X011810Y007520D01*
X011822Y007539D01*
X011826Y007560D01*
X011822Y007581D01*
X011810Y007600D01*
X011811Y007604D01*
X011968D01*
X011980Y007577D01*
D02*
G37*
G36*
X012744Y007530D02*
X012738Y007521D01*
X012734Y007500D01*
X012738Y007479D01*
X012703Y007455D01*
X012662D01*
Y007336D01*
X012170D01*
X012165Y007335D01*
X012043D01*
D01*
X012043D01*
X012033Y007344D01*
Y007415D01*
X012043D01*
Y007415D01*
X012155D01*
Y007490D01*
X012170D01*
Y007505D01*
X012297D01*
Y007557D01*
X012730D01*
X012744Y007530D01*
D02*
G37*
G36*
X009356Y007356D02*
X009356Y007356D01*
X009356Y007356D01*
X009616Y007096D01*
X009616Y007096D01*
X009616D01*
X009616Y007096D01*
X009616D01*
X009616Y007096D01*
Y007096D01*
Y007096D01*
D01*
D01*
X009616D01*
Y007096D01*
X009635Y007081D01*
X009657Y007072D01*
X009680Y007069D01*
X010112D01*
X010239Y006942D01*
Y006540D01*
X010239Y006540D01*
X010239D01*
X010242Y006517D01*
X010251Y006495D01*
X010266Y006476D01*
X010386Y006356D01*
X010386Y006356D01*
X010388Y006354D01*
X010379Y006325D01*
X009600D01*
X009600Y006325D01*
X009557Y006329D01*
X009515Y006339D01*
X009475Y006355D01*
X009439Y006378D01*
X009406Y006406D01*
X009378Y006439D01*
X009355Y006475D01*
X009339Y006515D01*
X009329Y006557D01*
X009325Y006600D01*
X009325Y006600D01*
Y007349D01*
X009354Y007358D01*
X009356Y007356D01*
D02*
G37*
G36*
X013782Y007319D02*
X013696Y007233D01*
X013480D01*
Y007250D01*
X013380D01*
D01*
X013380Y007250D01*
X013380Y007250D01*
D01*
X013380Y007250D01*
X013380Y007250D01*
Y007285D01*
X013330D01*
Y007315D01*
X013380D01*
Y007347D01*
X013771D01*
X013782Y007319D01*
D02*
G37*
G36*
X016070Y008290D02*
X016085D01*
Y008290D01*
X016127D01*
X016130Y008289D01*
X016140D01*
X016222Y008208D01*
X016210Y008180D01*
X016205D01*
Y008130D01*
X016190D01*
Y008115D01*
X016140D01*
Y008081D01*
X016100D01*
Y008115D01*
X016050D01*
Y008130D01*
X016035D01*
Y008180D01*
X015986D01*
Y008235D01*
X015986D01*
Y008295D01*
X015986Y008295D01*
X016015D01*
Y008235D01*
X016035D01*
Y008295D01*
X016050D01*
Y008310D01*
X016070D01*
Y008290D01*
D02*
G37*
G36*
X016120Y008660D02*
Y008660D01*
X016120Y008660D01*
X016289D01*
Y008280D01*
X016262Y008269D01*
X016190Y008340D01*
Y008390D01*
Y008440D01*
Y008510D01*
X016085D01*
Y008565D01*
X016083D01*
Y008626D01*
X016118Y008661D01*
X016120Y008660D01*
D02*
G37*
G36*
X013417Y007696D02*
Y007560D01*
X013419Y007549D01*
X013419Y007547D01*
X013427Y007537D01*
X013472Y007491D01*
X013461Y007463D01*
X013434D01*
X013380Y007517D01*
Y007550D01*
Y007585D01*
X013330D01*
Y007600D01*
X013315D01*
Y007650D01*
X013280D01*
D01*
X013280Y007650D01*
X013280D01*
Y007650D01*
D01*
X013245D01*
Y007600D01*
X013230D01*
Y007585D01*
X013180D01*
Y007606D01*
X013152Y007595D01*
X013068Y007679D01*
X013079Y007707D01*
X013406D01*
X013417Y007696D01*
D02*
G37*
G36*
X014052Y008812D02*
X014077Y008787D01*
X014087Y008779D01*
X014089Y008779D01*
X014100Y008777D01*
X014400D01*
X014405Y008778D01*
X014412Y008772D01*
X014420Y008732D01*
Y007980D01*
X013580D01*
Y008820D01*
X014046D01*
X014052Y008812D01*
D02*
G37*
G36*
X016543Y010471D02*
X016585Y010461D01*
X016625Y010445D01*
X016661Y010422D01*
X016694Y010394D01*
X016722Y010361D01*
X016745Y010325D01*
X016761Y010285D01*
X016771Y010243D01*
X016775Y010200D01*
X016775Y010200D01*
Y006600D01*
X016775Y006600D01*
X016771Y006557D01*
X016761Y006515D01*
X016745Y006475D01*
X016722Y006439D01*
X016694Y006406D01*
X016661Y006378D01*
X016625Y006355D01*
X016585Y006339D01*
X016543Y006329D01*
X016500Y006325D01*
X016500Y006325D01*
X015521D01*
X015512Y006354D01*
X015514Y006356D01*
X015764Y006606D01*
X015764Y006606D01*
X015764Y006606D01*
X015769Y006612D01*
X015796Y006639D01*
Y006761D01*
X015748Y006809D01*
X015652D01*
X015604Y006761D01*
Y006702D01*
X015570Y006668D01*
X015542Y006680D01*
Y006685D01*
X015461D01*
Y006591D01*
X015454D01*
X015465Y006563D01*
X015412Y006511D01*
X014758D01*
X014747Y006538D01*
X014814Y006606D01*
X014819Y006612D01*
X014846Y006639D01*
Y006761D01*
X014798Y006809D01*
X014702D01*
X014654Y006761D01*
Y006702D01*
X014620Y006668D01*
X014592Y006680D01*
Y006685D01*
X014511D01*
Y006591D01*
X014504D01*
X014515Y006563D01*
X014462Y006511D01*
X013808D01*
X013797Y006538D01*
X013864Y006606D01*
X013864Y006606D01*
X013869Y006612D01*
X013896Y006639D01*
Y006761D01*
X013848Y006809D01*
X013752D01*
X013704Y006761D01*
Y006702D01*
X013670Y006668D01*
X013642Y006680D01*
Y006685D01*
X013561D01*
Y006591D01*
X013554D01*
X013565Y006563D01*
X013512Y006511D01*
X012941D01*
Y006634D01*
X012946Y006639D01*
Y006761D01*
X012941Y006766D01*
Y006990D01*
X013015D01*
Y007070D01*
X013030D01*
Y007085D01*
X013125D01*
Y007109D01*
X013153Y007120D01*
X013180Y007093D01*
Y007050D01*
X013280D01*
D01*
X013280Y007050D01*
X013280Y007050D01*
X013280D01*
Y007050D01*
Y007050D01*
X013315D01*
Y007100D01*
X013345D01*
Y007050D01*
X013380D01*
D01*
X013380Y007050D01*
X013380Y007050D01*
X013380D01*
Y007050D01*
Y007050D01*
X013415D01*
Y007100D01*
X013430D01*
Y007115D01*
X013480D01*
Y007150D01*
Y007167D01*
X013580D01*
Y007150D01*
X013580D01*
Y007077D01*
X013396Y006893D01*
X013220D01*
X013207Y006891D01*
X013197Y006883D01*
X013122Y006809D01*
X013056D01*
X013008Y006761D01*
Y006639D01*
X013056Y006591D01*
X013152D01*
X013200Y006639D01*
Y006761D01*
X013199Y006762D01*
Y006792D01*
X013234Y006827D01*
X013410D01*
X013421Y006829D01*
X013423Y006829D01*
X013433Y006837D01*
X013647Y007050D01*
X013780D01*
D01*
X013780Y007050D01*
X013780Y007050D01*
X013780D01*
Y007050D01*
Y007050D01*
X013915D01*
Y007100D01*
X013945D01*
Y007050D01*
X013980D01*
D01*
X013980Y007050D01*
X013980Y007050D01*
X013980D01*
D01*
X013997Y007050D01*
Y006800D01*
X013958Y006761D01*
Y006639D01*
X014006Y006591D01*
X014102D01*
X014150Y006639D01*
Y006761D01*
X014102Y006809D01*
X014063D01*
Y007050D01*
X014180D01*
Y007050D01*
X014180D01*
X014180Y007050D01*
X014190D01*
Y007050D01*
X014325D01*
Y007100D01*
Y007150D01*
X014247D01*
X014180Y007217D01*
Y007250D01*
X014158D01*
Y007630D01*
X014174Y007712D01*
X014186Y007717D01*
X014189Y007717D01*
X014191Y007718D01*
X014202Y007723D01*
X014211Y007717D01*
X014225Y007714D01*
D01*
D01*
D01*
X014225Y007714D01*
X014225Y007714D01*
D01*
X014225Y007714D01*
X014239Y007717D01*
Y007650D01*
X014200D01*
Y007550D01*
X014335D01*
Y007600D01*
X014365D01*
Y007550D01*
X014400D01*
D01*
X014400Y007550D01*
X014400Y007550D01*
X014400D01*
Y007550D01*
Y007550D01*
X014435D01*
Y007600D01*
X014465D01*
Y007550D01*
X014600D01*
Y007650D01*
X014570D01*
X014515Y007705D01*
X014504Y007713D01*
X014490Y007716D01*
X014445D01*
X014411Y007750D01*
Y007840D01*
Y007930D01*
Y007960D01*
X014420D01*
X014428Y007961D01*
X014434Y007966D01*
X014439Y007972D01*
X014439Y007974D01*
X014464Y007990D01*
X014470Y007989D01*
X014650D01*
X014664Y007992D01*
X014675Y008000D01*
X014683Y008011D01*
X014686Y008025D01*
X014683Y008039D01*
X014675Y008050D01*
X014683Y008061D01*
X014686Y008075D01*
X014683Y008089D01*
X014675Y008100D01*
X014683Y008111D01*
X014686Y008125D01*
X014683Y008139D01*
X014685Y008142D01*
X014956D01*
X014958Y008129D01*
X014970Y008110D01*
X014989Y008098D01*
X015010Y008094D01*
X015031Y008098D01*
X015037Y008102D01*
X015067Y008096D01*
X015070Y008090D01*
X015077Y008086D01*
Y007770D01*
X015050D01*
Y007670D01*
Y007570D01*
X015067D01*
Y007484D01*
X015026Y007443D01*
X014650D01*
X014637Y007441D01*
X014634Y007438D01*
X014627Y007433D01*
X014575Y007382D01*
X014545D01*
X014543Y007385D01*
X014457D01*
X014415Y007343D01*
Y007257D01*
X014457Y007215D01*
X014543D01*
X014585Y007257D01*
Y007274D01*
X014610Y007291D01*
X014615Y007289D01*
Y007257D01*
X014657Y007215D01*
X014743D01*
X014785Y007257D01*
Y007343D01*
X014778Y007349D01*
X014785Y007365D01*
X014815D01*
X014822Y007349D01*
X014815Y007343D01*
Y007257D01*
X014857Y007215D01*
X014943D01*
X014985Y007257D01*
Y007343D01*
X014978Y007349D01*
X014985Y007365D01*
X015015D01*
X015022Y007349D01*
X015015Y007343D01*
Y007257D01*
X015057Y007215D01*
X015143D01*
X015185Y007257D01*
Y007329D01*
X015190Y007331D01*
X015215Y007314D01*
Y007257D01*
X015240Y007232D01*
X015254Y007211D01*
X015249Y007203D01*
X015249Y007203D01*
X015249D01*
X015196Y007150D01*
X015150D01*
D01*
X015150Y007150D01*
X015150D01*
Y007150D01*
D01*
X014950D01*
Y007050D01*
X014967D01*
Y006809D01*
X014956D01*
X014908Y006761D01*
Y006639D01*
X014956Y006591D01*
X015052D01*
X015100Y006639D01*
Y006761D01*
X015052Y006809D01*
X015033D01*
Y007050D01*
X015150D01*
D01*
X015150Y007050D01*
X015150Y007050D01*
X015150D01*
Y007050D01*
Y007050D01*
X015285D01*
Y007100D01*
X015315D01*
Y007050D01*
X015350D01*
D01*
X015350Y007050D01*
X015350Y007050D01*
X015350D01*
Y007050D01*
Y007050D01*
X015385D01*
Y007100D01*
X015415D01*
Y007050D01*
X015550D01*
D01*
X015550Y007050D01*
X015550Y007050D01*
X015550D01*
Y007050D01*
Y007050D01*
X015693D01*
X015906Y006837D01*
X015906Y006809D01*
X015906D01*
X015906Y006809D01*
X015858Y006761D01*
Y006639D01*
X015906Y006591D01*
X016002D01*
X016050Y006639D01*
Y006761D01*
X016002Y006809D01*
X015987D01*
Y006836D01*
X015985Y006849D01*
X015977Y006859D01*
X015750Y007087D01*
Y007150D01*
X015616D01*
X015605Y007178D01*
X015623Y007197D01*
X015631Y007207D01*
X015631D01*
Y007207D01*
D01*
X015631D01*
X015631Y007207D01*
X015647Y007226D01*
D01*
X015657Y007215D01*
X015743D01*
X015785Y007257D01*
Y007343D01*
X015743Y007385D01*
X015657D01*
X015649Y007376D01*
X015623Y007383D01*
Y007383D01*
X015623D01*
D01*
Y007383D01*
D01*
X015483Y007524D01*
Y007961D01*
X015511Y007972D01*
X015577Y007907D01*
X015584Y007902D01*
X015587Y007899D01*
X015600Y007897D01*
X016106D01*
X016550Y007453D01*
Y007400D01*
Y007300D01*
D01*
Y007300D01*
X016550Y007300D01*
X016530D01*
Y007161D01*
X016530Y007161D01*
X016530D01*
X016530Y007160D01*
Y007140D01*
D01*
D01*
D01*
D01*
X016530D01*
Y007085D01*
X016670D01*
Y007139D01*
X016670Y007139D01*
D01*
D01*
X016670Y007140D01*
Y007145D01*
Y007150D01*
Y007153D01*
Y007160D01*
X016670Y007161D01*
X016670Y007161D01*
X016670Y007161D01*
X016670D01*
Y007300D01*
X016650D01*
Y007300D01*
X016650Y007300D01*
X016650Y007300D01*
Y007400D01*
Y007500D01*
X016597D01*
X016178Y007919D01*
X016189Y007947D01*
X016310D01*
X016321Y007949D01*
X016323Y007949D01*
X016333Y007957D01*
X016413Y008037D01*
X016421Y008047D01*
X016423Y008060D01*
X016423Y008060D01*
X016423Y008060D01*
Y008060D01*
Y009126D01*
X016597Y009300D01*
X016650D01*
Y009400D01*
Y009500D01*
D01*
Y009500D01*
X016650Y009500D01*
X016670D01*
Y009639D01*
X016670Y009639D01*
D01*
D01*
X016670Y009640D01*
Y009645D01*
Y009650D01*
Y009653D01*
Y009660D01*
X016670Y009661D01*
X016670Y009661D01*
X016670Y009661D01*
X016670D01*
Y009715D01*
X016530D01*
Y009661D01*
X016530Y009661D01*
X016530D01*
X016530Y009660D01*
Y009640D01*
D01*
D01*
X016530D01*
Y009500D01*
X016550D01*
Y009500D01*
X016550Y009500D01*
X016550Y009500D01*
Y009400D01*
Y009347D01*
X016399Y009195D01*
X016371Y009207D01*
Y010120D01*
X016370Y010124D01*
X016370Y010124D01*
X016370Y010124D01*
X016397Y010137D01*
X016414Y010114D01*
X016439Y010095D01*
X016469Y010083D01*
X016500Y010079D01*
X016531Y010083D01*
X016561Y010095D01*
X016586Y010114D01*
X016605Y010139D01*
X016617Y010169D01*
X016621Y010200D01*
X016617Y010231D01*
X016605Y010261D01*
X016586Y010286D01*
X016561Y010305D01*
X016531Y010317D01*
X016500Y010321D01*
X016469Y010317D01*
X016439Y010305D01*
X016414Y010286D01*
X016395Y010261D01*
X016383Y010231D01*
X016379Y010200D01*
X016383Y010169D01*
X016386Y010162D01*
X016386Y010162D01*
D01*
X016359Y010148D01*
X016359Y010149D01*
X016359Y010149D01*
X016079Y010429D01*
X016066Y010438D01*
X016063Y010438D01*
X016050Y010441D01*
X016050Y010441D01*
X015992D01*
X015948Y010459D01*
X015944Y010468D01*
X015949Y010475D01*
X016500D01*
X016500Y010475D01*
X016543Y010471D01*
D02*
G37*
G36*
X016029Y010151D02*
Y009780D01*
X015965D01*
Y009730D01*
Y009680D01*
X016029D01*
Y009627D01*
X016002Y009615D01*
X015983Y009633D01*
X015973Y009641D01*
X015971Y009641D01*
X015960Y009643D01*
X015810D01*
X015797Y009641D01*
X015787Y009633D01*
X015738Y009585D01*
X015657D01*
X015615Y009543D01*
Y009457D01*
X015657Y009415D01*
X015743D01*
X015785Y009457D01*
Y009514D01*
X015810Y009531D01*
X015815Y009529D01*
Y009457D01*
X015857Y009416D01*
Y009384D01*
X015823Y009350D01*
X015670D01*
Y009333D01*
X015259D01*
X015248Y009361D01*
X015302Y009415D01*
X015343D01*
X015385Y009457D01*
Y009543D01*
X015343Y009585D01*
X015258D01*
X015257Y009585D01*
X015257Y009585D01*
X015233Y009595D01*
Y009906D01*
X015331Y010004D01*
X015421D01*
X015469Y010052D01*
Y010148D01*
X015458Y010159D01*
X015470Y010187D01*
X015530D01*
X015542Y010159D01*
X015531Y010148D01*
Y010115D01*
X015723D01*
Y010148D01*
X015712Y010159D01*
X015720Y010179D01*
X015750Y010184D01*
X015785Y010149D01*
X015785Y010148D01*
Y010052D01*
X015833Y010004D01*
X015929D01*
X015977Y010052D01*
Y010148D01*
X015929Y010196D01*
X015833D01*
X015832Y010196D01*
X015784Y010243D01*
X015774Y010251D01*
X015772Y010251D01*
X015761Y010253D01*
X015310D01*
X015297Y010251D01*
X015287Y010243D01*
X015227Y010183D01*
X015221Y010175D01*
X015212Y010174D01*
X015183Y010180D01*
X015167Y010196D01*
X015071D01*
X015070Y010196D01*
X014964Y010302D01*
X014976Y010329D01*
X015851D01*
X016029Y010151D01*
D02*
G37*
G36*
X011739Y010290D02*
Y010249D01*
X011729Y010235D01*
X011722Y010218D01*
X011719Y010200D01*
X011722Y010182D01*
X011727Y010168D01*
X011721Y010159D01*
X011701Y010143D01*
X011502D01*
X011490Y010155D01*
X011490D01*
X011490Y010155D01*
Y010185D01*
X011400D01*
Y010200D01*
X011385D01*
Y010290D01*
X011355D01*
X011310Y010245D01*
X011310D01*
D01*
X011290D01*
X011245Y010290D01*
X011155D01*
X011110Y010245D01*
X011110D01*
D01*
X011090D01*
X011045Y010290D01*
X010955D01*
X010910Y010245D01*
X010910D01*
D01*
X010890D01*
X010845Y010290D01*
X010755D01*
X010710Y010245D01*
X010690D01*
X010656Y010279D01*
Y010329D01*
X011739D01*
Y010290D01*
D02*
G37*
G36*
X012215Y010302D02*
X012158Y010245D01*
X012150Y010246D01*
X012129Y010242D01*
X012110Y010230D01*
X012098Y010211D01*
X012094Y010190D01*
X012098Y010169D01*
X012060Y010143D01*
X011879D01*
X011859Y010159D01*
X011853Y010168D01*
X011858Y010182D01*
X011861Y010200D01*
X011858Y010218D01*
X011851Y010235D01*
X011853Y010240D01*
X011875D01*
Y010290D01*
X011890D01*
Y010305D01*
X011940D01*
Y010329D01*
X012203D01*
X012215Y010302D01*
D02*
G37*
G36*
X015023Y010149D02*
X015023Y010148D01*
Y010052D01*
X015071Y010004D01*
X015118D01*
X015129Y009976D01*
X015127Y009973D01*
X015119Y009963D01*
X015119Y009961D01*
X015117Y009950D01*
Y009724D01*
X014975Y009582D01*
X014945D01*
X014943Y009585D01*
X014901D01*
X014890Y009613D01*
X014913Y009637D01*
X014921Y009647D01*
X014923Y009660D01*
X014923Y009660D01*
X014923Y009660D01*
Y009660D01*
Y010014D01*
X014961Y010052D01*
Y010148D01*
X014913Y010196D01*
X014817D01*
X014769Y010148D01*
Y010052D01*
X014817Y010004D01*
X014857D01*
Y009809D01*
X014829Y009798D01*
X014813Y009813D01*
X014803Y009821D01*
X014801Y009821D01*
X014790Y009823D01*
X014614D01*
X014598Y009839D01*
Y010004D01*
X014599D01*
X014647Y010052D01*
Y010148D01*
X014599Y010196D01*
X014503D01*
X014455Y010148D01*
Y010091D01*
X014427Y010080D01*
X014393Y010114D01*
Y010148D01*
X014345Y010196D01*
X014249D01*
X014201Y010148D01*
Y010052D01*
X014249Y010004D01*
X014345D01*
X014362Y010021D01*
X014392D01*
X014487Y009926D01*
Y009770D01*
X014470Y009770D01*
D01*
X014470D01*
Y009770D01*
D01*
X014351D01*
X014351Y009773D01*
X014348Y009776D01*
X014343Y009783D01*
X014122Y010005D01*
Y010035D01*
X014139Y010052D01*
Y010148D01*
X014091Y010196D01*
X013995D01*
X013947Y010148D01*
Y010052D01*
X013995Y010004D01*
X014029D01*
X014135Y009898D01*
X014133Y009868D01*
X014120Y009860D01*
X014108Y009841D01*
X014107Y009837D01*
X014079Y009828D01*
X013913Y009993D01*
X013903Y010001D01*
X013901Y010001D01*
X013890Y010003D01*
X013876D01*
X013864Y010031D01*
X013885Y010052D01*
Y010085D01*
X013693D01*
Y010052D01*
X013714Y010031D01*
X013702Y010003D01*
X013674D01*
X013577Y010100D01*
Y010148D01*
X013529Y010196D01*
X013433D01*
X013385Y010148D01*
Y010052D01*
X013396Y010041D01*
X013389Y010023D01*
X013359Y010018D01*
X013323Y010054D01*
Y010148D01*
X013275Y010196D01*
X013179D01*
X013131Y010148D01*
Y010052D01*
X013179Y010004D01*
X013271D01*
X013287Y009979D01*
X013288Y009980D01*
X013281Y009963D01*
X012722D01*
X012706Y009988D01*
X012712Y010004D01*
X012704D01*
Y010085D01*
X012623D01*
Y010093D01*
X012595Y010082D01*
X012543Y010133D01*
X012533Y010141D01*
X012531Y010141D01*
X012520Y010143D01*
X012240D01*
X012202Y010169D01*
X012206Y010190D01*
X012205Y010198D01*
X012284Y010277D01*
X012805D01*
X012808Y010259D01*
X012820Y010240D01*
X012839Y010228D01*
X012860Y010224D01*
X012879Y010228D01*
X012885Y010223D01*
X012902Y010197D01*
Y010174D01*
X012877Y010148D01*
Y010052D01*
X012925Y010004D01*
X013021D01*
X013069Y010052D01*
Y010148D01*
X013044Y010174D01*
Y010208D01*
X013067Y010227D01*
X013080Y010224D01*
X013101Y010228D01*
X013120Y010240D01*
X013132Y010259D01*
X013135Y010277D01*
X014895D01*
X015023Y010149D01*
D02*
G37*
%LPC*%
G36*
X016585Y007055D02*
X016530D01*
Y007000D01*
X016585D01*
Y007055D01*
D02*
G37*
G36*
X013125D02*
X013045D01*
Y006990D01*
X013125D01*
Y007055D01*
D02*
G37*
G36*
X013480Y007085D02*
X013445D01*
Y007050D01*
X013480D01*
Y007085D01*
D02*
G37*
G36*
X016670Y007055D02*
X016615D01*
Y007000D01*
X016670D01*
Y007055D01*
D02*
G37*
G36*
X015431Y006809D02*
X015398D01*
X015350Y006761D01*
Y006715D01*
X015431D01*
Y006809D01*
D02*
G37*
G36*
X014544D02*
X014511D01*
Y006715D01*
X014592D01*
Y006761D01*
X014544Y006809D01*
D02*
G37*
G36*
X012705Y006985D02*
X012670D01*
Y006950D01*
X012705D01*
Y006985D01*
D02*
G37*
G36*
X015494Y006809D02*
X015461D01*
Y006715D01*
X015542D01*
Y006761D01*
X015494Y006809D01*
D02*
G37*
G36*
X014390Y007085D02*
X014355D01*
Y007050D01*
X014390D01*
Y007085D01*
D02*
G37*
G36*
X011940Y010275D02*
X011905D01*
Y010240D01*
X011940D01*
Y010275D01*
D02*
G37*
G36*
X016143Y007385D02*
X016057D01*
X016015Y007343D01*
Y007257D01*
X016057Y007215D01*
X016143D01*
X016185Y007257D01*
Y007343D01*
X016143Y007385D01*
D02*
G37*
G36*
X016585Y009800D02*
X016530D01*
Y009745D01*
X016585D01*
Y009800D01*
D02*
G37*
G36*
X011855Y007310D02*
X011775D01*
Y007245D01*
X011855D01*
Y007310D01*
D02*
G37*
G36*
Y007215D02*
X011775D01*
Y007150D01*
X011855D01*
Y007215D01*
D02*
G37*
G36*
X014390Y007150D02*
X014355D01*
Y007115D01*
X014390D01*
Y007150D01*
D02*
G37*
G36*
X015943Y007385D02*
X015857D01*
X015815Y007343D01*
Y007257D01*
X015857Y007215D01*
X015943D01*
X015985Y007257D01*
Y007343D01*
X015943Y007385D01*
D02*
G37*
G36*
X014343D02*
X014257D01*
X014215Y007343D01*
Y007257D01*
X014257Y007215D01*
X014343D01*
X014385Y007257D01*
Y007343D01*
X014343Y007385D01*
D02*
G37*
G36*
X014481Y006809D02*
X014448D01*
X014400Y006761D01*
Y006715D01*
X014481D01*
Y006809D01*
D02*
G37*
G36*
X012581Y006685D02*
X012500D01*
Y006639D01*
X012548Y006591D01*
X012581D01*
Y006685D01*
D02*
G37*
G36*
X012223D02*
X012142D01*
Y006591D01*
X012175D01*
X012223Y006639D01*
Y006685D01*
D02*
G37*
G36*
X013531D02*
X013450D01*
Y006639D01*
X013498Y006591D01*
X013531D01*
Y006685D01*
D02*
G37*
G36*
X012692D02*
X012611D01*
Y006591D01*
X012644D01*
X012692Y006639D01*
Y006685D01*
D02*
G37*
G36*
X016500Y006721D02*
X016469Y006717D01*
X016439Y006705D01*
X016414Y006686D01*
X016395Y006661D01*
X016383Y006631D01*
X016379Y006600D01*
X016383Y006569D01*
X016395Y006539D01*
X016414Y006514D01*
X016439Y006495D01*
X016469Y006483D01*
X016500Y006479D01*
X016531Y006483D01*
X016561Y006495D01*
X016586Y006514D01*
X016605Y006539D01*
X016617Y006569D01*
X016621Y006600D01*
X016617Y006631D01*
X016605Y006661D01*
X016586Y006686D01*
X016561Y006705D01*
X016531Y006717D01*
X016500Y006721D01*
D02*
G37*
G36*
X016670Y009800D02*
X016615D01*
Y009745D01*
X016670D01*
Y009800D01*
D02*
G37*
G36*
X012112Y006685D02*
X012031D01*
Y006639D01*
X012079Y006591D01*
X012112D01*
Y006685D01*
D02*
G37*
G36*
X009600Y006721D02*
X009569Y006717D01*
X009539Y006705D01*
X009514Y006686D01*
X009495Y006661D01*
X009483Y006631D01*
X009479Y006600D01*
X009483Y006569D01*
X009495Y006539D01*
X009514Y006514D01*
X009539Y006495D01*
X009569Y006483D01*
X009600Y006479D01*
X009631Y006483D01*
X009661Y006495D01*
X009686Y006514D01*
X009705Y006539D01*
X009717Y006569D01*
X009721Y006600D01*
X009717Y006631D01*
X009705Y006661D01*
X009686Y006686D01*
X009661Y006705D01*
X009631Y006717D01*
X009600Y006721D01*
D02*
G37*
G36*
X014481Y006685D02*
X014400D01*
Y006639D01*
X014448Y006591D01*
X014481D01*
Y006685D01*
D02*
G37*
G36*
X012644Y006809D02*
X012611D01*
Y006715D01*
X012692D01*
Y006761D01*
X012644Y006809D01*
D02*
G37*
G36*
X012581D02*
X012548D01*
X012500Y006761D01*
Y006715D01*
X012581D01*
Y006809D01*
D02*
G37*
G36*
X013594D02*
X013561D01*
Y006715D01*
X013642D01*
Y006761D01*
X013594Y006809D01*
D02*
G37*
G36*
X013531D02*
X013498D01*
X013450Y006761D01*
Y006715D01*
X013531D01*
Y006809D01*
D02*
G37*
G36*
X011445Y006690D02*
X011415D01*
Y006615D01*
X011490D01*
Y006645D01*
X011445Y006690D01*
D02*
G37*
G36*
X015431Y006685D02*
X015350D01*
Y006639D01*
X015398Y006591D01*
X015431D01*
Y006685D01*
D02*
G37*
G36*
X012175Y006809D02*
X012142D01*
Y006715D01*
X012223D01*
Y006761D01*
X012175Y006809D01*
D02*
G37*
G36*
X012112D02*
X012079D01*
X012031Y006761D01*
Y006715D01*
X012112D01*
Y006809D01*
D02*
G37*
G36*
X011935Y008780D02*
X011865D01*
Y008732D01*
X011935D01*
Y008780D01*
D02*
G37*
G36*
X012630Y008750D02*
X012595D01*
Y008715D01*
X012630D01*
Y008750D01*
D02*
G37*
G36*
X016125Y008910D02*
X016070D01*
Y008855D01*
X016125D01*
Y008910D01*
D02*
G37*
G36*
X009600Y010321D02*
X009569Y010317D01*
X009539Y010305D01*
X009514Y010286D01*
X009495Y010261D01*
X009483Y010231D01*
X009479Y010200D01*
X009483Y010169D01*
X009495Y010139D01*
X009514Y010114D01*
X009539Y010095D01*
X009569Y010083D01*
X009600Y010079D01*
X009631Y010083D01*
X009661Y010095D01*
X009686Y010114D01*
X009705Y010139D01*
X009717Y010169D01*
X009721Y010200D01*
X009717Y010231D01*
X009705Y010261D01*
X009686Y010286D01*
X009661Y010305D01*
X009631Y010317D01*
X009600Y010321D01*
D02*
G37*
G36*
X009922Y008626D02*
Y008542D01*
X010006D01*
X010004Y008553D01*
X009994Y008577D01*
X009978Y008598D01*
X009957Y008614D01*
X009933Y008624D01*
X009922Y008626D01*
D02*
G37*
G36*
X009892D02*
X009881Y008624D01*
X009857Y008614D01*
X009836Y008598D01*
X009820Y008577D01*
X009810Y008553D01*
X009808Y008542D01*
X009892D01*
Y008626D01*
D02*
G37*
G36*
X010205Y009985D02*
X010170D01*
Y009950D01*
X010205D01*
Y009985D01*
D02*
G37*
G36*
X009907Y008882D02*
X009881Y008878D01*
X009857Y008868D01*
X009836Y008852D01*
X009820Y008831D01*
X009810Y008807D01*
X009806Y008781D01*
X009810Y008755D01*
X009820Y008731D01*
X009836Y008710D01*
X009857Y008694D01*
X009881Y008684D01*
X009907Y008680D01*
X009933Y008684D01*
X009957Y008694D01*
X009978Y008710D01*
X009994Y008731D01*
X010004Y008755D01*
X010008Y008781D01*
X010004Y008807D01*
X009994Y008831D01*
X009978Y008852D01*
X009957Y008868D01*
X009933Y008878D01*
X009907Y008882D01*
D02*
G37*
G36*
X010205Y010050D02*
X010170D01*
Y010015D01*
X010205D01*
Y010050D01*
D02*
G37*
G36*
X011490Y009585D02*
X011415D01*
Y009510D01*
X011445D01*
X011490Y009555D01*
Y009585D01*
D02*
G37*
G36*
X015543D02*
X015457D01*
X015415Y009543D01*
Y009457D01*
X015457Y009415D01*
X015543D01*
X015585Y009457D01*
Y009543D01*
X015543Y009585D01*
D02*
G37*
G36*
X012815Y010085D02*
X012734D01*
Y010004D01*
X012767D01*
X012815Y010052D01*
Y010085D01*
D02*
G37*
G36*
X011445Y009690D02*
X011415D01*
Y009615D01*
X011490D01*
Y009645D01*
X011445Y009690D01*
D02*
G37*
G36*
X015723Y010085D02*
X015642D01*
Y010004D01*
X015675D01*
X015723Y010052D01*
Y010085D01*
D02*
G37*
G36*
X015935Y009715D02*
X015900D01*
Y009680D01*
X015935D01*
Y009715D01*
D02*
G37*
G36*
X015612Y010085D02*
X015531D01*
Y010052D01*
X015579Y010004D01*
X015612D01*
Y010085D01*
D02*
G37*
G36*
X013225Y009455D02*
X013145D01*
Y009390D01*
X013225D01*
Y009455D01*
D02*
G37*
G36*
X009668Y008626D02*
Y008542D01*
X009752D01*
X009750Y008553D01*
X009740Y008577D01*
X009724Y008598D01*
X009703Y008614D01*
X009679Y008624D01*
X009668Y008626D01*
D02*
G37*
G36*
X013837Y010196D02*
X013804D01*
Y010115D01*
X013885D01*
Y010148D01*
X013837Y010196D01*
D02*
G37*
G36*
X013380Y007650D02*
X013345D01*
Y007615D01*
X013380D01*
Y007650D01*
D02*
G37*
G36*
X016175Y008180D02*
X016140D01*
Y008145D01*
X016175D01*
Y008180D01*
D02*
G37*
G36*
X016100D02*
X016065D01*
Y008145D01*
X016100D01*
Y008180D01*
D02*
G37*
G36*
X012297Y007475D02*
X012185D01*
Y007415D01*
X012297D01*
Y007475D01*
D02*
G37*
G36*
X011445Y010290D02*
X011415D01*
Y010215D01*
X011490D01*
Y010245D01*
X011445Y010290D01*
D02*
G37*
G36*
X013215Y007650D02*
X013180D01*
Y007615D01*
X013215D01*
Y007650D01*
D02*
G37*
G36*
X015935Y009780D02*
X015900D01*
Y009745D01*
X015935D01*
Y009780D01*
D02*
G37*
G36*
X013774Y010196D02*
X013741D01*
X013693Y010148D01*
Y010115D01*
X013774D01*
Y010196D01*
D02*
G37*
G36*
X009892Y008512D02*
X009808D01*
X009810Y008501D01*
X009820Y008477D01*
X009836Y008456D01*
X009857Y008440D01*
X009881Y008430D01*
X009892Y008428D01*
Y008512D01*
D02*
G37*
G36*
X009752D02*
X009668D01*
Y008428D01*
X009679Y008430D01*
X009703Y008440D01*
X009724Y008456D01*
X009740Y008477D01*
X009750Y008501D01*
X009752Y008512D01*
D02*
G37*
G36*
X009638Y008626D02*
X009627Y008624D01*
X009603Y008614D01*
X009582Y008598D01*
X009566Y008577D01*
X009556Y008553D01*
X009554Y008542D01*
X009638D01*
Y008626D01*
D02*
G37*
G36*
X010006Y008512D02*
X009922D01*
Y008428D01*
X009933Y008430D01*
X009957Y008440D01*
X009978Y008456D01*
X009994Y008477D01*
X010004Y008501D01*
X010006Y008512D01*
D02*
G37*
G36*
X012767Y010196D02*
X012734D01*
Y010115D01*
X012815D01*
Y010148D01*
X012767Y010196D01*
D02*
G37*
G36*
X016085Y008280D02*
X016065D01*
Y008235D01*
X016085D01*
Y008280D01*
D02*
G37*
G36*
X009638Y008512D02*
X009554D01*
X009556Y008501D01*
X009566Y008477D01*
X009582Y008456D01*
X009603Y008440D01*
X009627Y008430D01*
X009638Y008428D01*
Y008512D01*
D02*
G37*
G36*
X012704Y010196D02*
X012671D01*
X012623Y010148D01*
Y010115D01*
X012704D01*
Y010196D01*
D02*
G37*
%LPD*%
D10*
X012025Y008960D02*
D03*
Y009010D02*
D03*
Y009060D02*
D03*
X011875D02*
D03*
Y009010D02*
D03*
Y008960D02*
D03*
X012025Y009270D02*
D03*
Y009320D02*
D03*
Y009370D02*
D03*
X011875D02*
D03*
Y009320D02*
D03*
Y009270D02*
D03*
X012025Y009580D02*
D03*
Y009630D02*
D03*
Y009680D02*
D03*
X011875D02*
D03*
Y009630D02*
D03*
Y009580D02*
D03*
X012025Y009890D02*
D03*
Y009940D02*
D03*
Y009990D02*
D03*
X011875D02*
D03*
Y009940D02*
D03*
Y009890D02*
D03*
D11*
X012190D02*
D03*
Y009990D02*
D03*
X011710Y009680D02*
D03*
Y009580D02*
D03*
X011710Y009370D02*
D03*
Y009270D02*
D03*
X011710Y009060D02*
D03*
Y008960D02*
D03*
X012190Y009580D02*
D03*
Y009680D02*
D03*
Y009270D02*
D03*
Y009370D02*
D03*
Y008960D02*
D03*
Y009060D02*
D03*
X015100Y008820D02*
D03*
Y008920D02*
D03*
X013230Y007600D02*
D03*
Y007500D02*
D03*
Y007300D02*
D03*
Y007400D02*
D03*
X012580Y008700D02*
D03*
Y008600D02*
D03*
X013230Y007200D02*
D03*
Y007100D02*
D03*
X013330D02*
D03*
Y007200D02*
D03*
X013430Y007100D02*
D03*
Y007200D02*
D03*
X013330Y007600D02*
D03*
Y007500D02*
D03*
Y007300D02*
D03*
Y007400D02*
D03*
X015100Y007720D02*
D03*
Y007620D02*
D03*
X015210Y007720D02*
D03*
Y007620D02*
D03*
X013800Y009220D02*
D03*
Y009320D02*
D03*
X014800Y008840D02*
D03*
Y008740D02*
D03*
X013080Y008750D02*
D03*
Y008850D02*
D03*
Y008650D02*
D03*
Y008550D02*
D03*
X016600Y007450D02*
D03*
Y007350D02*
D03*
Y009350D02*
D03*
Y009450D02*
D03*
X013180Y008110D02*
D03*
Y008210D02*
D03*
X012110Y008690D02*
D03*
Y008790D02*
D03*
X012550Y009700D02*
D03*
Y009600D02*
D03*
D12*
X013380Y009700D02*
D03*
X013280D02*
D03*
X010260Y007850D02*
D03*
X010360D02*
D03*
Y007750D02*
D03*
X010260D02*
D03*
X010360Y007950D02*
D03*
X010260D02*
D03*
Y008050D02*
D03*
X010360D02*
D03*
Y008150D02*
D03*
X010260D02*
D03*
Y008250D02*
D03*
X010360D02*
D03*
X014340Y007100D02*
D03*
X014240D02*
D03*
X013930D02*
D03*
X013830D02*
D03*
X014030Y007200D02*
D03*
X014130D02*
D03*
X013930D02*
D03*
X013830D02*
D03*
X015400Y007100D02*
D03*
X015500D02*
D03*
X015300D02*
D03*
X015200D02*
D03*
X013730D02*
D03*
X013630D02*
D03*
X014130D02*
D03*
X014030D02*
D03*
X015700D02*
D03*
X015600D02*
D03*
X015100D02*
D03*
X015000D02*
D03*
X016050Y008130D02*
D03*
X015950D02*
D03*
X016190D02*
D03*
X016290D02*
D03*
X015720D02*
D03*
X015820D02*
D03*
X016170Y008710D02*
D03*
X016270D02*
D03*
X013560Y009220D02*
D03*
X013660D02*
D03*
X014220Y009720D02*
D03*
X014120D02*
D03*
X013920D02*
D03*
X014020D02*
D03*
X016150Y009730D02*
D03*
X016250D02*
D03*
X016050D02*
D03*
X015950D02*
D03*
X015720Y009300D02*
D03*
X015820D02*
D03*
X015720Y009200D02*
D03*
X015820D02*
D03*
X014250Y007600D02*
D03*
X014350D02*
D03*
X014550D02*
D03*
X014450D02*
D03*
X013700D02*
D03*
X013600D02*
D03*
X010360Y007650D02*
D03*
X010260D02*
D03*
Y007550D02*
D03*
X010360D02*
D03*
X010320Y010000D02*
D03*
X010220D02*
D03*
X012820Y007000D02*
D03*
X012720D02*
D03*
X013350Y009210D02*
D03*
X013250D02*
D03*
X013280Y009600D02*
D03*
X013380D02*
D03*
X013520Y009720D02*
D03*
X013620D02*
D03*
X013820D02*
D03*
X013720D02*
D03*
X014820D02*
D03*
X014720D02*
D03*
X014520D02*
D03*
X014620D02*
D03*
X014320D02*
D03*
X014420D02*
D03*
X011790Y010290D02*
D03*
X011890D02*
D03*
D13*
X016300Y008840D02*
D03*
X016140D02*
D03*
D14*
X016600Y009570D02*
D03*
Y009730D02*
D03*
Y007230D02*
D03*
Y007070D02*
D03*
X011710Y008320D02*
D03*
Y008480D02*
D03*
D15*
X013625Y008960D02*
D03*
X013675D02*
D03*
X013725D02*
D03*
X013775D02*
D03*
X013825D02*
D03*
X013875D02*
D03*
X013925D02*
D03*
X013975D02*
D03*
X014025D02*
D03*
X014075D02*
D03*
X014125D02*
D03*
X014175D02*
D03*
X014225D02*
D03*
X014275D02*
D03*
X014325D02*
D03*
X014375D02*
D03*
Y007840D02*
D03*
X014325D02*
D03*
X014275D02*
D03*
X014225D02*
D03*
X014175D02*
D03*
X014125D02*
D03*
X014075D02*
D03*
X014025D02*
D03*
X013975D02*
D03*
X013925D02*
D03*
X013875D02*
D03*
X013825D02*
D03*
X013775D02*
D03*
X013725D02*
D03*
X013675D02*
D03*
X013625D02*
D03*
D16*
X014560Y008775D02*
D03*
Y008725D02*
D03*
Y008675D02*
D03*
Y008625D02*
D03*
Y008575D02*
D03*
Y008525D02*
D03*
Y008475D02*
D03*
Y008425D02*
D03*
Y008375D02*
D03*
Y008325D02*
D03*
Y008275D02*
D03*
Y008225D02*
D03*
Y008175D02*
D03*
Y008125D02*
D03*
Y008075D02*
D03*
Y008025D02*
D03*
X013440D02*
D03*
Y008075D02*
D03*
Y008125D02*
D03*
Y008175D02*
D03*
Y008225D02*
D03*
Y008275D02*
D03*
Y008325D02*
D03*
Y008375D02*
D03*
Y008425D02*
D03*
Y008475D02*
D03*
Y008525D02*
D03*
Y008575D02*
D03*
Y008625D02*
D03*
Y008675D02*
D03*
Y008725D02*
D03*
Y008775D02*
D03*
D17*
X012790Y007260D02*
D03*
D18*
X012170Y007030D02*
D03*
Y007490D02*
D03*
D19*
Y007260D02*
D03*
D20*
X012690Y009695D02*
D03*
Y009600D02*
D03*
Y009505D02*
D03*
X012950D02*
D03*
Y009695D02*
D03*
D21*
X013130Y009670D02*
D03*
Y009470D02*
D03*
X011870Y007030D02*
D03*
Y007230D02*
D03*
X013030Y007270D02*
D03*
Y007070D02*
D03*
D22*
X012820Y009040D02*
D03*
Y008620D02*
D03*
D23*
X011950Y008605D02*
D03*
X011950Y008795D02*
D03*
X011730Y008700D02*
D03*
D24*
X015950Y008505D02*
D03*
X016000D02*
D03*
X016050D02*
D03*
Y008295D02*
D03*
X016000D02*
D03*
X015950D02*
D03*
D25*
X016130Y008475D02*
D03*
Y008425D02*
D03*
Y008375D02*
D03*
Y008325D02*
D03*
X015870D02*
D03*
Y008375D02*
D03*
Y008425D02*
D03*
Y008475D02*
D03*
D26*
X013230Y007600D02*
Y007670D01*
X013350Y008780D02*
Y009050D01*
X012515Y009505D02*
X012690D01*
X012465Y009555D02*
X012515Y009505D01*
X012465Y009555D02*
Y009750D01*
X013625Y008960D02*
Y009135D01*
X013560Y009200D02*
X013625Y009135D01*
X013560Y009200D02*
Y009220D01*
X013345Y008775D02*
X013350Y008780D01*
X013345Y008775D02*
X013440D01*
X011200Y009960D02*
X011270Y009890D01*
X011875D01*
X011710Y009680D02*
X011710Y009680D01*
X011980D02*
X012025D01*
X011890Y009770D02*
X011980Y009680D01*
X011370Y009770D02*
X011890D01*
X011200Y009600D02*
X011370Y009770D01*
X011805Y009510D02*
X011875Y009580D01*
X011640Y009510D02*
X011805D01*
X011580Y009450D02*
X011640Y009510D01*
X011580Y009380D02*
Y009450D01*
X011200Y009000D02*
X011580Y009380D01*
X011710Y009370D02*
X011710Y009370D01*
X011680Y009460D02*
X011890D01*
X011640Y009420D02*
X011680Y009460D01*
X011640Y009270D02*
Y009420D01*
X011980Y009370D02*
X012025D01*
X011890Y009460D02*
X011980Y009370D01*
X011520Y009150D02*
X011640Y009270D01*
X011805Y009200D02*
X011875Y009270D01*
X011650Y009200D02*
X011805D01*
X011580Y009130D02*
X011650Y009200D01*
X011520Y008910D02*
Y009150D01*
X011460Y008850D02*
X011520Y008910D01*
X011460Y008660D02*
Y008850D01*
X011200Y008400D02*
X011460Y008660D01*
X011580Y008880D02*
Y009130D01*
X011510Y008810D02*
X011580Y008880D01*
X011830Y008960D02*
X011875D01*
X011620Y008750D02*
X011830Y008960D01*
X011620Y008230D02*
Y008750D01*
X011640Y008860D02*
Y009110D01*
X011570Y008790D02*
X011640Y008860D01*
X011570Y008160D02*
Y008790D01*
X011640Y009110D02*
X011680Y009150D01*
X011570Y008160D02*
X011670Y008060D01*
X011620Y008230D02*
X011770Y008080D01*
X011900Y009150D02*
X011990Y009060D01*
X011680Y009150D02*
X011900D01*
X011710Y009060D02*
X011710Y009060D01*
X011990D02*
X012025D01*
X011770Y008060D02*
Y008080D01*
X011520Y007140D02*
Y007300D01*
X011200Y006820D02*
X011520Y007140D01*
X011200Y006600D02*
Y006820D01*
X011520Y007300D02*
X011770Y007550D01*
X011430Y007320D02*
X011670Y007560D01*
X011320Y007320D02*
X011430D01*
X011200Y007200D02*
X011320Y007320D01*
X011770Y007550D02*
Y007560D01*
X013090Y008110D02*
X013180D01*
X013725Y007840D02*
Y008155D01*
X013830Y009820D02*
X013920Y009730D01*
Y009720D02*
Y009730D01*
X013230Y007670D02*
X013280D01*
X013330Y007600D02*
Y007670D01*
X013280D02*
X013330D01*
Y007100D02*
X013430D01*
X013230Y007300D02*
X013330D01*
X014030Y007290D02*
X014030Y007290D01*
Y007200D02*
Y007290D01*
X013930Y007200D02*
X014030D01*
X013930Y007100D02*
Y007200D01*
X013600Y007600D02*
Y007665D01*
X013615Y007680D01*
X013650D01*
X013675Y007705D01*
Y007840D01*
X013180Y008110D02*
X013200D01*
X013265Y008175D02*
X013440D01*
X013200Y008110D02*
X013265Y008175D01*
X013675Y008960D02*
Y009215D01*
X014560Y008725D02*
X014785D01*
X014800Y008740D01*
Y008840D02*
X014810Y008850D01*
X014800Y008740D02*
X014810Y008750D01*
X014890D01*
X014560Y008775D02*
X014715D01*
X014780Y008840D01*
X014800D01*
X014275Y007625D02*
Y007840D01*
X014450Y007510D02*
Y007600D01*
X014325Y007625D02*
Y007840D01*
X013725Y007625D02*
Y007840D01*
X013700Y007600D02*
X013725Y007625D01*
X014375Y007840D02*
Y008075D01*
X014325Y007625D02*
X014350Y007600D01*
X014250D02*
X014275Y007625D01*
X014350Y007510D02*
Y007600D01*
Y007510D02*
X014350Y007510D01*
X014375Y007735D02*
Y007840D01*
Y007735D02*
X014430Y007680D01*
X014490D01*
X014550Y007620D01*
Y007600D02*
Y007620D01*
X013190Y008225D02*
X013440D01*
X015950Y008130D02*
Y008295D01*
X015840Y008130D02*
X015950D01*
X016280Y008140D02*
X016290Y008130D01*
X016050D02*
X016190D01*
X016050D02*
X016055Y008135D01*
X016130Y008325D02*
X016155D01*
X016280Y008200D01*
Y008140D02*
Y008200D01*
X016270Y008710D02*
X016330D01*
X016050Y008215D02*
Y008295D01*
X016000Y008210D02*
Y008295D01*
Y008400D01*
X013100Y008210D02*
X013180D01*
X013090Y008200D02*
X013100Y008210D01*
X011955Y008790D02*
X012110D01*
X011950Y008795D02*
X011955Y008790D01*
X013340Y009810D02*
X013440D01*
X013280Y009750D02*
X013340Y009810D01*
X013280Y009700D02*
Y009750D01*
X013520Y009720D02*
Y009730D01*
X013440Y009810D02*
X013520Y009730D01*
X013380Y009700D02*
X013451D01*
X013820Y009720D02*
Y009810D01*
X013830Y009820D01*
X011710Y009060D02*
X011875D01*
X012025Y008960D02*
X012190D01*
X011710Y009370D02*
X011875D01*
X012025Y009270D02*
X012190D01*
X011710Y009680D02*
X011875D01*
X012025Y009580D02*
X012190D01*
X012025Y009890D02*
X012190D01*
X013350Y009220D02*
X013560D01*
X014160Y009800D02*
Y009820D01*
Y009800D02*
X014220Y009740D01*
Y009720D02*
Y009740D01*
X011200Y008150D02*
X011450D01*
X011510Y008210D01*
Y008810D01*
X014435Y008775D02*
X014560D01*
X014355Y008695D02*
X014435Y008775D01*
X013000Y008550D02*
X013080D01*
X013080Y008550D01*
X013170Y009210D02*
X013250D01*
X013660Y009220D02*
Y009300D01*
X013650Y009310D02*
X013660Y009300D01*
D27*
X014255Y009395D02*
X014625D01*
X014120Y009530D02*
X014255Y009395D01*
X014120Y009530D02*
Y009720D01*
X012550Y009370D02*
X012560Y009360D01*
X013260Y008790D02*
X013325Y008725D01*
X013210Y008776D02*
X013309Y008678D01*
X013160Y008760D02*
X013293Y008628D01*
X013090Y008750D02*
X013265Y008575D01*
X012980Y009300D02*
X013260Y009020D01*
Y008790D02*
Y009020D01*
X012966Y009250D02*
X013210Y009006D01*
Y008776D02*
Y009006D01*
X012953Y009200D02*
X013160Y008993D01*
Y008760D02*
Y008993D01*
X012480Y008790D02*
Y009120D01*
X013470Y009880D02*
X013620Y009730D01*
X012680Y009880D02*
X013470D01*
X012500Y010060D02*
X012680Y009880D01*
X013520Y009930D02*
X013720Y009730D01*
X012700Y009930D02*
X013520D01*
X012520Y010110D02*
X012700Y009930D01*
X013875Y008960D02*
Y009455D01*
X013620Y009710D02*
X013875Y009455D01*
X013620Y009710D02*
Y009720D01*
X013925Y008960D02*
Y009495D01*
X013720Y009700D02*
X013925Y009495D01*
X013720Y009700D02*
Y009720D01*
X013620D02*
Y009730D01*
X013720D02*
X013730D01*
X013690Y009390D02*
X013725Y009355D01*
X013530Y009390D02*
X013690D01*
X011950Y008605D02*
X012035Y008690D01*
X012110D01*
Y008610D02*
Y008690D01*
X012320Y009740D02*
Y009990D01*
Y009740D02*
X012390Y009670D01*
Y009530D02*
Y009670D01*
X012310Y009500D02*
Y009660D01*
X012260Y009710D02*
X012310Y009660D01*
X012260Y009710D02*
Y009940D01*
X012210Y009370D02*
X012253Y009328D01*
Y009188D02*
Y009328D01*
Y009188D02*
X012350Y009090D01*
X012320Y009240D02*
X012400Y009160D01*
Y008730D02*
Y009160D01*
X012496Y009250D02*
X012966D01*
X012260Y009486D02*
X012496Y009250D01*
X012260Y009486D02*
Y009630D01*
X012510Y009300D02*
X012980D01*
X012310Y009500D02*
X012510Y009300D01*
X011485Y010035D02*
X011510Y010060D01*
X010965Y010035D02*
X011485D01*
X011510Y010060D02*
X012500D01*
X011490Y010110D02*
X012520D01*
X011460Y010080D02*
X011490Y010110D01*
X012184Y009990D02*
X012190D01*
X012134Y009940D02*
X012184Y009990D01*
X012025Y009940D02*
X012134D01*
X012210Y009990D02*
X012260Y009940D01*
X012190Y009990D02*
X012210D01*
Y009680D02*
X012260Y009630D01*
X012190Y009680D02*
X012210D01*
X012480Y009200D02*
X012953D01*
X012210Y009470D02*
X012480Y009200D01*
X012000Y009470D02*
X012210D01*
X012350Y008710D02*
Y009090D01*
Y008710D02*
X012635Y008425D01*
X012255Y008665D02*
Y009001D01*
Y008665D02*
X012595Y008325D01*
X012190Y009060D02*
X012196D01*
X012255Y009001D01*
X012230Y009140D02*
X012300Y009070D01*
Y008690D02*
Y009070D01*
Y008690D02*
X012615Y008375D01*
X012030Y009140D02*
X012230D01*
X012190Y009370D02*
X012210D01*
X012184Y009680D02*
X012190D01*
X012134Y009630D02*
X012184Y009680D01*
X012025Y009630D02*
X012134D01*
X012184Y009370D02*
X012190D01*
X012134Y009320D02*
X012184Y009370D01*
X012025Y009320D02*
X012134D01*
X011950Y009220D02*
X012030Y009140D01*
X011950Y009220D02*
Y009300D01*
X011930Y009320D02*
X011950Y009300D01*
X011875Y009320D02*
X011930D01*
X011950Y009520D02*
X012000Y009470D01*
X011950Y009520D02*
Y009601D01*
X011923Y009628D02*
X011950Y009601D01*
X011878Y009628D02*
X011923D01*
X011875Y009630D02*
X011878Y009628D01*
X011710Y009580D02*
X011716D01*
X011766Y009630D01*
X011875D01*
X011710Y009270D02*
X011716D01*
X011766Y009320D01*
X011875D01*
X012000Y008870D02*
X012150D01*
X011950Y008920D02*
X012000Y008870D01*
X011950Y008920D02*
Y008981D01*
X012184Y009060D02*
X012190D01*
X012134Y009010D02*
X012184Y009060D01*
X012025Y009010D02*
X012134D01*
X012150Y008870D02*
X012210Y008810D01*
X011923Y009007D02*
X011950Y008981D01*
X011878Y009007D02*
X011923D01*
X011875Y009010D02*
X011878Y009007D01*
X011710Y008960D02*
X011716D01*
X011766Y009010D01*
X011875D01*
X012210Y008640D02*
Y008810D01*
X014551Y010100D02*
X014565Y010086D01*
Y009825D02*
Y010086D01*
Y009825D02*
X014600Y009790D01*
X014790D01*
X014820Y009760D01*
Y009720D02*
Y009760D01*
X014520Y009720D02*
Y009940D01*
X014360Y010100D02*
X014520Y009940D01*
X014300Y010100D02*
X014360D01*
X013660Y009970D02*
X013890D01*
X013530Y010100D02*
X013660Y009970D01*
X013481Y010100D02*
X013530D01*
X013630Y009920D02*
X013840D01*
X013570Y009980D02*
X013630Y009920D01*
X015310Y010220D02*
X015761D01*
X015250Y010160D02*
X015310Y010220D01*
X015250Y010050D02*
Y010160D01*
X015761Y010220D02*
X015881Y010100D01*
X014120Y009720D02*
Y009740D01*
X013890Y009970D02*
X014120Y009740D01*
X014020Y009720D02*
Y009740D01*
X013840Y009920D02*
X014020Y009740D01*
X014865Y010100D02*
X014890Y010075D01*
Y009660D02*
Y010075D01*
X014800Y009570D02*
X014890Y009660D01*
X014610Y009710D02*
X014620Y009720D01*
X014610Y009610D02*
Y009710D01*
X014600Y009600D02*
X014610Y009610D01*
X014410Y009710D02*
X014420Y009720D01*
X014410Y009610D02*
Y009710D01*
X014400Y009600D02*
X014410Y009610D01*
X014040Y009440D02*
X014130D01*
X014220Y009350D01*
X014560D01*
X014100Y009160D02*
X014175Y009085D01*
Y008960D02*
Y009085D01*
X014200Y009160D02*
X014225Y009135D01*
Y008960D02*
Y009135D01*
X014625Y009395D02*
X014860Y009160D01*
X014560Y009350D02*
X014850Y009060D01*
X014075Y008835D02*
X014100Y008810D01*
X014450Y008860D02*
X014680D01*
X014850Y009060D02*
X014860D01*
X014680Y009010D02*
X014710Y008980D01*
X014910Y008930D02*
X014998Y009018D01*
X014375Y008930D02*
X014910D01*
X014375D02*
Y008960D01*
X014998Y009018D02*
Y009557D01*
X014710Y008980D02*
X014890D01*
X014950Y009040D01*
Y009290D01*
X014800Y009440D02*
X014950Y009290D01*
X014800Y009440D02*
Y009570D01*
X014075Y008835D02*
Y008960D01*
X014998Y009557D02*
X015150Y009710D01*
Y009950D02*
X015250Y010050D01*
X015150Y009710D02*
Y009950D01*
X015200Y009920D02*
X015376Y010096D01*
X015200Y009440D02*
Y009920D01*
X014043Y010037D02*
Y010100D01*
X015300Y009460D02*
Y009500D01*
X015100Y009260D02*
X015300Y009460D01*
X015100Y008920D02*
Y009260D01*
Y008790D02*
Y008820D01*
X015050Y008740D02*
X015100Y008790D01*
X015050Y008990D02*
Y009290D01*
X014970Y008910D02*
X015050Y008990D01*
X014970Y008710D02*
Y008910D01*
X013220Y007100D02*
X013230D01*
X013160Y007160D02*
X013220Y007100D01*
X013360Y007380D02*
X013820D01*
X013340Y007400D02*
X013360Y007380D01*
X013330Y007400D02*
X013340D01*
X013230D02*
X013330D01*
Y007500D02*
X013350D01*
X013230D02*
X013330D01*
X013420Y007430D02*
X013800D01*
X013350Y007500D02*
X013420Y007430D01*
X010560Y008070D02*
X011530D01*
X010380Y008250D02*
X010560Y008070D01*
X010360Y008250D02*
X010380D01*
X010510Y008020D02*
X011516D01*
X010380Y008150D02*
X010510Y008020D01*
X010360Y008150D02*
X010380D01*
X010460Y007970D02*
X011503D01*
X010380Y008050D02*
X010460Y007970D01*
X010360Y008050D02*
X010380D01*
X010360Y007950D02*
X010390Y007920D01*
X010450Y007580D02*
X011510D01*
X010380Y007650D02*
X010450Y007580D01*
X010360Y007650D02*
X010380D01*
X010550Y007680D02*
X011456D01*
X010370Y007860D02*
X010550Y007680D01*
X010370Y007860D02*
Y007860D01*
X010370Y007760D02*
X010500Y007630D01*
X010360Y007550D02*
X010380Y007530D01*
X010500Y007630D02*
X011480D01*
X010020Y007950D02*
X010250D01*
X009960Y007890D02*
X010020Y007950D01*
X009782Y007890D02*
X009960D01*
X010090Y007650D02*
X010250D01*
X009951Y007511D02*
X010090Y007650D01*
X009907Y007511D02*
X009951D01*
X010090Y007750D02*
X010250D01*
X009980Y007640D02*
X010090Y007750D01*
X009778Y007640D02*
X009980D01*
X010000Y007380D02*
X010170Y007550D01*
X009784Y007380D02*
X010000D01*
X009653Y007511D02*
X009784Y007380D01*
X010170Y007550D02*
X010250D01*
X009653Y007765D02*
X009778Y007640D01*
X009907Y007765D02*
X009987Y007845D01*
X010245D01*
X010255D02*
X010260Y007850D01*
X009653Y008019D02*
X009782Y007890D01*
X009907Y008019D02*
X009938Y008050D01*
X010250D01*
X009653Y008273D02*
X009776Y008150D01*
X010250D01*
X009907Y008273D02*
X009930Y008250D01*
X010250D01*
X010390Y007920D02*
X011489D01*
X011530Y007530D02*
X011638Y007638D01*
X010380Y007530D02*
X011530D01*
X011510Y007580D02*
X011620Y007690D01*
X013830Y007200D02*
Y007206D01*
X014075Y007451D01*
X013730Y007100D02*
X013830D01*
Y007200D01*
X014075Y007451D02*
Y007840D01*
X015220Y009300D02*
X015720D01*
X015165Y009245D02*
X015220Y009300D01*
X015165Y008745D02*
Y009245D01*
X015050Y009290D02*
X015200Y009440D01*
X015380Y008500D02*
Y008710D01*
X015270Y008820D02*
X015380Y008710D01*
X015270Y008820D02*
Y009140D01*
X015290Y009160D01*
X015305Y008425D02*
X015380Y008500D01*
X015320Y008520D02*
Y008680D01*
X015210Y008790D02*
X015320Y008680D01*
X015210Y008790D02*
Y009210D01*
X015240Y009240D01*
X015660D01*
X015165Y008745D02*
X015270Y008640D01*
Y008550D02*
Y008640D01*
X015245Y008525D02*
X015270Y008550D01*
X014560Y008525D02*
X015245D01*
X015275Y008475D02*
X015320Y008520D01*
X014985Y008175D02*
X015010Y008150D01*
X014560Y008175D02*
X014985D01*
X014935Y008675D02*
X014970Y008710D01*
X015110Y008130D02*
Y008140D01*
Y007730D02*
Y008130D01*
X015210Y007730D02*
X015220Y007720D01*
X015190Y008050D02*
X015210Y008030D01*
X014320Y009720D02*
Y009760D01*
X014043Y010037D02*
X014320Y009760D01*
X014620Y009720D02*
X014720D01*
X014025Y008960D02*
Y009715D01*
X013800Y009220D02*
X013825Y009195D01*
Y008960D02*
Y009195D01*
X014560Y008425D02*
X015305D01*
X014560Y008675D02*
X014935D01*
X015040Y007410D02*
X015100Y007470D01*
X014650Y007410D02*
X015040D01*
X014540Y007300D02*
X014650Y007410D01*
X015100Y007470D02*
Y007620D01*
X015300Y007300D02*
X015300D01*
X015210Y007390D02*
X015300Y007300D01*
X015210Y007390D02*
Y007620D01*
X015100Y007720D02*
X015110Y007730D01*
X015470Y009160D02*
X016000Y008630D01*
X014560Y008475D02*
X015275D01*
X015330Y007180D02*
X015400Y007250D01*
X015273Y007180D02*
X015330D01*
X015201Y007109D02*
X015273Y007180D01*
X015600Y007220D02*
Y007360D01*
X015500Y007120D02*
X015600Y007220D01*
X015500Y007100D02*
Y007120D01*
Y007100D02*
X015600D01*
X015100D02*
X015200D01*
X014230D02*
Y007120D01*
X014125Y007225D02*
X014230Y007120D01*
X014125Y007225D02*
Y007840D01*
X014130Y007100D02*
X014230D01*
X015954Y006700D02*
Y006836D01*
X015700Y007090D02*
X015954Y006836D01*
X015700Y007090D02*
X015700D01*
X011530Y008070D02*
X011610Y007990D01*
X011516Y008020D02*
X011596Y007940D01*
X011503Y007970D02*
X011583Y007890D01*
X011489Y007920D02*
X011569Y007840D01*
X015000Y006704D02*
X015004Y006700D01*
X015000Y006704D02*
Y007100D01*
X014030Y006724D02*
X014054Y006700D01*
X014030Y006724D02*
Y007110D01*
X013104Y006700D02*
Y006744D01*
X013220Y006860D01*
X016600Y007230D02*
Y007350D01*
Y009450D02*
Y009570D01*
X013725Y008960D02*
Y009355D01*
X013345Y008025D02*
X013440D01*
X013210Y007890D02*
X013345Y008025D01*
X013325Y008075D02*
X013440D01*
X013190Y007940D02*
X013325Y008075D01*
X013305Y008125D02*
X013440D01*
X015165Y008275D02*
X015450Y007990D01*
Y007510D02*
Y007990D01*
Y007510D02*
X015600Y007360D01*
X014500Y007300D02*
X014540D01*
X015210Y007730D02*
Y008030D01*
X015400Y007250D02*
Y007950D01*
X015125Y008225D02*
X015400Y007950D01*
X014560Y008225D02*
X015125D01*
X015700Y009200D02*
X015720D01*
X015660Y009240D02*
X015700Y009200D01*
X015830D02*
X016002Y009372D01*
X015820Y009300D02*
X015890Y009370D01*
X015185Y008575D02*
X015210Y008600D01*
X015075Y008625D02*
X015110Y008660D01*
X015700Y009500D02*
X015810Y009610D01*
X015960D01*
X016002Y009568D01*
Y009372D02*
Y009568D01*
X015890Y009490D02*
X015900Y009500D01*
X015890Y009370D02*
Y009490D01*
X014560Y008625D02*
X015075D01*
X014560Y008575D02*
X015185D01*
X014560Y008375D02*
X015235D01*
X014560Y008325D02*
X015205D01*
X015600Y007930D01*
X015235Y008375D02*
X015630Y007980D01*
X016000Y008505D02*
Y008630D01*
X015290Y009160D02*
X015470D01*
X015950Y008505D02*
Y008600D01*
X015490Y009060D02*
X015950Y008600D01*
X015350Y009060D02*
X015490D01*
X015755Y008475D02*
X015870D01*
X015710Y008430D02*
X015755Y008475D01*
X015710Y008130D02*
Y008430D01*
X016120Y008710D02*
X016170D01*
X016050Y008640D02*
X016120Y008710D01*
X016050Y008505D02*
Y008640D01*
X015600Y007930D02*
X016120D01*
X014560Y008275D02*
X015165D01*
X011000Y010200D02*
X011120Y010080D01*
X010800Y010200D02*
X010965Y010035D01*
X011120Y010080D02*
X011460D01*
X016390Y009140D02*
X016600Y009350D01*
X016120Y007930D02*
X016600Y007450D01*
X016390Y008060D02*
Y009140D01*
X015630Y007980D02*
X016310D01*
X016390Y008060D01*
X011569Y007840D02*
X013625D01*
X011583Y007890D02*
X013210D01*
X011596Y007940D02*
X013190D01*
X013823Y007838D02*
X013825Y007840D01*
X013823Y007529D02*
Y007838D01*
X013779Y007485D02*
X013823Y007529D01*
X013875Y007505D02*
Y007840D01*
X013775Y007545D02*
Y007840D01*
X013760Y007530D02*
X013775Y007545D01*
X013502Y007578D02*
X013550Y007530D01*
X013760D01*
X013525Y007485D02*
X013779D01*
X013502Y007578D02*
Y007721D01*
X013800Y007430D02*
X013875Y007505D01*
X013925Y007485D02*
Y007840D01*
X013975Y007465D02*
Y007840D01*
X013710Y007200D02*
X013975Y007465D01*
X013420Y007740D02*
X013450Y007710D01*
Y007560D02*
X013525Y007485D01*
X013450Y007560D02*
Y007710D01*
X011566Y007790D02*
X013434D01*
X013502Y007721D01*
X013820Y007380D02*
X013925Y007485D01*
X013230Y007200D02*
X013710D01*
X013220Y006860D02*
X013410D01*
X013630Y007080D01*
Y007100D01*
X011456Y007680D02*
X011566Y007790D01*
X011480Y007630D02*
X011590Y007740D01*
X013420D01*
X012575Y008275D02*
X013440D01*
X012210Y008640D02*
X012575Y008275D01*
X012595Y008325D02*
X013440D01*
X012615Y008375D02*
X013440D01*
X012635Y008425D02*
X013440D01*
X012655Y008475D02*
X013440D01*
X013438Y008678D02*
X013440Y008675D01*
X013438Y008628D02*
X013440Y008625D01*
X013090Y008650D02*
X013100D01*
X013225Y008525D01*
X013440D01*
X013080Y008750D02*
X013090D01*
X013265Y008575D02*
X013440D01*
X013293Y008628D02*
X013438D01*
X013325Y008725D02*
X013440D01*
X013309Y008678D02*
X013438D01*
X013170Y007990D02*
X013305Y008125D01*
X011610Y007990D02*
X013170D01*
X012000Y007550D02*
X012040Y007590D01*
X011638Y007638D02*
X012973D01*
X013210Y007400D02*
X013230D01*
X012973Y007638D02*
X013210Y007400D01*
X012040Y007590D02*
X012940D01*
X013160Y007370D01*
Y007160D02*
Y007370D01*
X011620Y007690D02*
X013010D01*
X013200Y007500D01*
X013230D01*
X012000Y007030D02*
Y007550D01*
X012150Y010190D02*
X012270Y010310D01*
X012830D01*
X013110D02*
X014909D01*
X015119Y010100D01*
X013080Y010280D02*
X013110Y010310D01*
X012830D02*
X012860Y010280D01*
X012400Y008730D02*
X012655Y008475D01*
X012850Y008650D02*
X013080D01*
X012820Y008620D02*
X012850Y008650D01*
X012820Y009000D02*
Y009040D01*
Y009000D02*
X013070Y008750D01*
X013080D01*
X012560Y009360D02*
X013000D01*
X013440Y009300D02*
X013530Y009390D01*
X013000Y009360D02*
X013070Y009290D01*
X013250D01*
X013260Y009300D01*
X013227Y010100D02*
X013230D01*
X013350Y009980D01*
X013570D01*
X014400Y008810D02*
X014450Y008860D01*
X014100Y008810D02*
X014400D01*
D28*
X012440Y009780D02*
X012525Y009695D01*
X012440Y009780D02*
Y009970D01*
X011790Y010290D02*
Y010400D01*
Y010200D02*
Y010290D01*
X013160Y009700D02*
X013280D01*
X013130Y009670D02*
X013160Y009700D01*
X013280Y009600D02*
Y009700D01*
X012550Y009600D02*
X012690D01*
X013350Y009050D02*
Y009210D01*
Y009220D01*
X013280Y009560D02*
Y009600D01*
Y009560D02*
X013350Y009490D01*
Y009220D02*
Y009490D01*
X012525Y009695D02*
X012690D01*
D29*
X013350Y009050D02*
X013640Y008760D01*
X011900Y008130D02*
X012040D01*
X011710Y008320D02*
X011900Y008130D01*
X011710Y008680D02*
X011730Y008700D01*
X011710Y008480D02*
Y008680D01*
X012510Y007270D02*
X012520Y007260D01*
X012790Y007260D02*
X012790Y007260D01*
X012790Y007260D02*
Y007500D01*
D30*
X012950Y009695D02*
X013125D01*
X010600Y010380D02*
X010620Y010400D01*
X010600Y010200D02*
Y010380D01*
Y007200D02*
Y007210D01*
D31*
X010620Y010400D02*
X011790D01*
X010450D02*
X010620D01*
X009653Y009289D02*
X009907D01*
X015880Y010400D02*
X016100Y010180D01*
X010330Y010280D02*
X010450Y010400D01*
X012973Y010100D02*
Y010400D01*
X009907Y009289D02*
X009929D01*
X010330Y009690D01*
X011790Y010400D02*
X012973D01*
X013130Y009670D02*
Y009790D01*
X010330Y009690D02*
Y010280D01*
X012973Y010400D02*
X015880D01*
X016100Y009500D02*
Y010180D01*
D32*
X015880Y010400D02*
X016050D01*
X016330Y010120D01*
X016010Y008040D02*
X016270D01*
X015950Y008100D02*
X016010Y008040D01*
X015950Y008100D02*
Y008130D01*
X013800Y009320D02*
Y009400D01*
X012170Y007490D02*
X012330D01*
X016270Y008040D02*
X016330Y008100D01*
Y008710D01*
Y010120D01*
D33*
X009680Y007160D02*
X010150D01*
X009420Y007420D02*
X009680Y007160D01*
X009420Y007420D02*
Y008840D01*
X010330Y006540D02*
Y006980D01*
Y006540D02*
X010450Y006420D01*
X010150Y007160D02*
X010330Y006980D01*
X009615Y009035D02*
X009653D01*
X009420Y008840D02*
X009615Y009035D01*
X011873Y006700D02*
Y007020D01*
X014500Y006420D02*
X014750Y006670D01*
X014500Y006420D02*
X015450D01*
X013550D02*
X014500D01*
X015700Y006670D02*
Y006700D01*
X015450Y006420D02*
X015700Y006670D01*
X014750D02*
Y006700D01*
X013550Y006420D02*
X013800Y006670D01*
Y006700D01*
X010450Y006420D02*
X012850D01*
X013550D01*
X012850D02*
Y006700D01*
X009653Y009035D02*
X009907D01*
X012850Y006700D02*
Y007260D01*
D34*
X015775Y008425D02*
X015870D01*
X015752Y008403D02*
X015775Y008425D01*
X015752Y008268D02*
X015780Y008240D01*
X015757Y008375D02*
X015870D01*
X015752Y008268D02*
Y008370D01*
Y008403D01*
Y008370D02*
X015757Y008375D01*
D35*
X012170Y007030D02*
X012170Y007030D01*
X011870Y007030D02*
X012000D01*
X012170D01*
X012170Y007260D02*
X012520D01*
X012770D01*
X012790D01*
X012850D01*
X012770D02*
X012780Y007270D01*
D36*
X012790Y007270D02*
X013030D01*
D37*
X014865Y010100D02*
D03*
X015119D02*
D03*
X015373D02*
D03*
X015627D02*
D03*
X015881D02*
D03*
X016135D02*
D03*
X013481D02*
D03*
X013227D02*
D03*
X012973D02*
D03*
X012719D02*
D03*
X014551D02*
D03*
X014297D02*
D03*
X014043D02*
D03*
X013789D02*
D03*
D38*
X009907Y007511D02*
D03*
X009653D02*
D03*
X009907Y007765D02*
D03*
X009653D02*
D03*
X009907Y008019D02*
D03*
X009653D02*
D03*
X009907Y008273D02*
D03*
X009653D02*
D03*
X009907Y008527D02*
D03*
X009653D02*
D03*
Y009289D02*
D03*
X009907D02*
D03*
X009653Y009035D02*
D03*
X009907D02*
D03*
X009653Y008781D02*
D03*
X009907D02*
D03*
D39*
X014300Y009500D02*
D03*
X015700Y007300D02*
D03*
X015500D02*
D03*
X014500D02*
D03*
X014300D02*
D03*
X014500Y009500D02*
D03*
X014700D02*
D03*
X016100Y007300D02*
D03*
Y009500D02*
D03*
X015900D02*
D03*
X015700D02*
D03*
X015500D02*
D03*
X015300D02*
D03*
X015100D02*
D03*
X014900D02*
D03*
X014700Y007300D02*
D03*
X014900D02*
D03*
X015100Y007300D02*
D03*
X015300Y007300D02*
D03*
X015900D02*
D03*
D40*
X011400Y010200D02*
D03*
X011200D02*
D03*
X011000D02*
D03*
X010800D02*
D03*
X010600D02*
D03*
X011400Y009600D02*
D03*
X011200D02*
D03*
X011000D02*
D03*
X010800D02*
D03*
X010600D02*
D03*
X011400Y006600D02*
D03*
X011200D02*
D03*
X011000D02*
D03*
X010800D02*
D03*
X010600D02*
D03*
X011400Y009000D02*
D03*
X011200D02*
D03*
X011000D02*
D03*
X010800D02*
D03*
X010600D02*
D03*
X011400Y007200D02*
D03*
X011200D02*
D03*
X011000D02*
D03*
X010800D02*
D03*
X010600D02*
D03*
X011400Y007800D02*
D03*
X011200D02*
D03*
X011000D02*
D03*
X010800D02*
D03*
X010600D02*
D03*
X011400Y008400D02*
D03*
X011200D02*
D03*
X011000D02*
D03*
X010800D02*
D03*
X010600D02*
D03*
D41*
X012596Y006700D02*
D03*
X012850D02*
D03*
X013104D02*
D03*
X013546D02*
D03*
X013800D02*
D03*
X014054D02*
D03*
X011873D02*
D03*
X012127D02*
D03*
X015004D02*
D03*
X014750D02*
D03*
X014496D02*
D03*
X015954D02*
D03*
X015700D02*
D03*
X015446D02*
D03*
D42*
X012440Y008130D02*
D03*
X012040D02*
D03*
D43*
X013130Y009790D02*
D03*
X011790Y010200D02*
D03*
X012440Y009970D02*
D03*
D44*
X013170Y009210D02*
D03*
X013260Y009300D02*
D03*
X012550Y009370D02*
D03*
X012480Y009120D02*
D03*
X013440Y009300D02*
D03*
X013630Y008110D02*
D03*
X011830Y008800D02*
D03*
X012150Y010190D02*
D03*
X012320Y009990D02*
D03*
X012390Y009530D02*
D03*
X012320Y009240D02*
D03*
X012480Y008790D02*
D03*
X012110Y008610D02*
D03*
Y009250D02*
D03*
X011790Y009390D02*
D03*
X012110Y009870D02*
D03*
X011200Y009960D02*
D03*
X012110Y009560D02*
D03*
X011790Y009700D02*
D03*
X012110Y008940D02*
D03*
X011790Y009080D02*
D03*
X011200Y008150D02*
D03*
X011770Y008060D02*
D03*
X011670D02*
D03*
X011770Y007560D02*
D03*
X011670D02*
D03*
X015060Y010280D02*
D03*
X015070Y009950D02*
D03*
X014700Y010230D02*
D03*
X015840Y010270D02*
D03*
X014190Y010000D02*
D03*
X014070Y009910D02*
D03*
X014440Y009820D02*
D03*
X014550Y010390D02*
D03*
X012810Y009800D02*
D03*
X014160Y009820D02*
D03*
X013830D02*
D03*
X014680Y008860D02*
D03*
Y009010D02*
D03*
Y009110D02*
D03*
X016360Y010430D02*
D03*
X009360Y006800D02*
D03*
X009790Y006360D02*
D03*
X012610Y007390D02*
D03*
X012360Y007140D02*
D03*
X010180Y007440D02*
D03*
X010460Y006610D02*
D03*
X009760Y007300D02*
D03*
X009830Y006820D02*
D03*
X011370Y008690D02*
D03*
X010180Y006910D02*
D03*
X010470Y008270D02*
D03*
X009370Y008990D02*
D03*
X009550Y007630D02*
D03*
Y008150D02*
D03*
Y007880D02*
D03*
X010070Y007020D02*
D03*
X013030Y006950D02*
D03*
X013700Y007300D02*
D03*
X013280Y007670D02*
D03*
X014030Y007290D02*
D03*
X015370Y008370D02*
D03*
X016140Y008960D02*
D03*
X016490Y009730D02*
D03*
Y007070D02*
D03*
X016000Y007420D02*
D03*
X016040Y006830D02*
D03*
X016310Y006370D02*
D03*
X015980Y009990D02*
D03*
X015280Y009890D02*
D03*
X014400Y009260D02*
D03*
X014970Y009650D02*
D03*
X012050Y010290D02*
D03*
X012860Y010280D02*
D03*
X013080D02*
D03*
X015010Y008150D02*
D03*
X014200Y009160D02*
D03*
X014100D02*
D03*
X014600Y009600D02*
D03*
X014400D02*
D03*
X014460Y009000D02*
D03*
X013800Y009400D02*
D03*
X016250Y008350D02*
D03*
X016140Y008610D02*
D03*
X016480Y009040D02*
D03*
X016420Y009300D02*
D03*
X016150Y010430D02*
D03*
X014810Y009870D02*
D03*
X012810Y009600D02*
D03*
X009780Y009410D02*
D03*
X011090Y006900D02*
D03*
X010900Y007390D02*
D03*
X011090Y008690D02*
D03*
X010900D02*
D03*
X010710D02*
D03*
X011090Y009320D02*
D03*
X010900D02*
D03*
X010710D02*
D03*
X011280Y009810D02*
D03*
X010900Y009900D02*
D03*
X010710D02*
D03*
X009870Y009960D02*
D03*
X009370Y009990D02*
D03*
X010280Y006360D02*
D03*
X009370Y007270D02*
D03*
X010490Y007390D02*
D03*
X010500Y006900D02*
D03*
X010710D02*
D03*
X010900D02*
D03*
X011720Y006770D02*
D03*
X014160Y006550D02*
D03*
X013670Y007010D02*
D03*
X014930D02*
D03*
X014800Y007210D02*
D03*
X015200D02*
D03*
X014200Y007510D02*
D03*
X015010Y007490D02*
D03*
X014630Y007680D02*
D03*
X015030Y008050D02*
D03*
X010310Y010430D02*
D03*
X015890Y008050D02*
D03*
X015350Y008960D02*
D03*
X011400Y008230D02*
D03*
X011090Y008160D02*
D03*
X010900D02*
D03*
X010710D02*
D03*
X015070Y007010D02*
D03*
X015240Y006560D02*
D03*
X014830D02*
D03*
X014420Y006550D02*
D03*
X013870D02*
D03*
X013250Y006780D02*
D03*
X013480Y006550D02*
D03*
X015592Y006365D02*
D03*
X012620Y007140D02*
D03*
X012010Y006910D02*
D03*
X014100Y007010D02*
D03*
X013930D02*
D03*
X013540Y007100D02*
D03*
X012350Y007390D02*
D03*
Y007510D02*
D03*
X015300Y007010D02*
D03*
X013090Y008200D02*
D03*
X016080Y007860D02*
D03*
X016460Y008420D02*
D03*
X016510Y007430D02*
D03*
X015530Y007540D02*
D03*
X016250Y008960D02*
D03*
X015860Y008560D02*
D03*
X016250Y009830D02*
D03*
X015590Y009370D02*
D03*
X015580Y009160D02*
D03*
X016020Y008720D02*
D03*
X015290Y009160D02*
D03*
X015350Y009060D02*
D03*
X014860D02*
D03*
Y009160D02*
D03*
X015790Y007100D02*
D03*
X016250Y009630D02*
D03*
X015950Y009820D02*
D03*
X016090Y009350D02*
D03*
X015530Y007870D02*
D03*
X014680Y007490D02*
D03*
X014470Y007930D02*
D03*
X015030Y007810D02*
D03*
X014740Y008090D02*
D03*
X014420Y007100D02*
D03*
X013460Y007010D02*
D03*
X016730Y009043D02*
D03*
Y009472D02*
D03*
Y010001D02*
D03*
Y008614D02*
D03*
Y008186D02*
D03*
Y007757D02*
D03*
Y007328D02*
D03*
Y006799D02*
D03*
X009370Y009550D02*
D03*
X015200Y008040D02*
D03*
X015110Y008130D02*
D03*
X015200Y008600D02*
D03*
X015110Y008660D02*
D03*
X015050Y008740D02*
D03*
X013570Y007690D02*
D03*
X014450Y007510D02*
D03*
X014890Y008750D02*
D03*
X014350Y007510D02*
D03*
X013650Y009310D02*
D03*
X015280Y009640D02*
D03*
X016120Y008210D02*
D03*
X015780Y008240D02*
D03*
X016000Y008400D02*
D03*
X016250Y007910D02*
D03*
X013090Y008110D02*
D03*
X013430Y007300D02*
D03*
X009790Y010430D02*
D03*
X013090Y008940D02*
D03*
X013000Y008550D02*
D03*
X012560Y008940D02*
D03*
X012790Y007500D02*
D03*
X012690Y007510D02*
D03*
X013100Y010190D02*
D03*
X013470Y009600D02*
D03*
X013440Y009810D02*
D03*
X012810Y009430D02*
D03*
X013440Y009420D02*
D03*
X013260Y009440D02*
D03*
X013130Y009360D02*
D03*
X013170Y007010D02*
D03*
X012720Y006900D02*
D03*
X011280Y006780D02*
D03*
X011920Y007560D02*
D03*
X011870Y007360D02*
D03*
X011730Y007230D02*
D03*
X011940Y006550D02*
D03*
X012720D02*
D03*
X012350Y006910D02*
D03*
X012220Y008070D02*
D03*
X011900Y008250D02*
D03*
X012210Y008530D02*
D03*
X011610Y009680D02*
D03*
X012020Y009760D02*
D03*
X010710Y007390D02*
D03*
X011090Y009900D02*
D03*
X010490D02*
D03*
Y009320D02*
D03*
X010500Y008690D02*
D03*
X010220Y009420D02*
D03*
X010050Y009190D02*
D03*
X010060Y008390D02*
D03*
X011400Y009320D02*
D03*
X011440Y007450D02*
D03*
X014110Y009360D02*
D03*
X012930Y008780D02*
D03*
X012640Y009130D02*
D03*
X012660Y008770D02*
D03*
X012450Y010230D02*
D03*
X010220Y009900D02*
D03*
X010050Y008910D02*
D03*
M02*
