%FSAX42Y42*%
%MOMM*%
G71*
G01*
G75*
G04 Layer_Physical_Order=1*
G04 Layer_Color=255*
%ADD10R,0.60X0.60*%
%ADD11R,0.60X0.60*%
%ADD12R,1.00X1.00*%
%ADD13R,0.50X1.50*%
%ADD14R,1.00X0.50*%
%ADD15C,0.30*%
%ADD16C,0.40*%
%ADD17P,1.52X8X22.5*%
%ADD18C,0.70*%
G36*
X010786Y009497D02*
X010775Y009484D01*
X010761Y009458D01*
X010752Y009429D01*
X010749Y009400D01*
X010752Y009371D01*
X010761Y009342D01*
X010775Y009316D01*
X010793Y009293D01*
X010816Y009275D01*
X010842Y009261D01*
X010871Y009252D01*
X010900Y009249D01*
X010929Y009252D01*
X010958Y009261D01*
X010984Y009275D01*
X010997Y009286D01*
X011025Y009273D01*
Y008727D01*
X010997Y008714D01*
X010984Y008725D01*
X010958Y008739D01*
X010929Y008748D01*
X010900Y008751D01*
X010871Y008748D01*
X010842Y008739D01*
X010839Y008737D01*
X010815Y008755D01*
X010816Y008760D01*
Y008769D01*
X010839Y008788D01*
X010860Y008784D01*
X010881Y008788D01*
X010900Y008800D01*
X010912Y008819D01*
X010916Y008840D01*
X010912Y008861D01*
X010900Y008880D01*
X010896Y008882D01*
Y009000D01*
X010893Y009014D01*
X010885Y009025D01*
X010840Y009070D01*
Y009100D01*
X010740D01*
Y009044D01*
X010730Y009036D01*
X010700D01*
Y009115D01*
Y009205D01*
X010566D01*
X010566Y009205D01*
Y009205D01*
X010560Y009205D01*
X010545Y009220D01*
Y009195D01*
X010515D01*
Y009115D01*
X010539D01*
X010560Y009094D01*
Y009035D01*
Y008955D01*
Y008885D01*
X010545D01*
Y008885D01*
X010515D01*
Y008790D01*
X010485D01*
Y008885D01*
X010455D01*
D01*
X010455D01*
X010440Y008900D01*
Y008905D01*
X010370D01*
Y008935D01*
X010440D01*
Y008955D01*
Y008985D01*
X010370D01*
Y009015D01*
X010440D01*
Y009035D01*
Y009065D01*
X010370D01*
Y009095D01*
X010440D01*
Y009115D01*
X010440D01*
X010455Y009115D01*
X010461Y009115D01*
X010461Y009115D01*
Y009115D01*
X010485D01*
Y009195D01*
X010455D01*
Y009220D01*
X010440Y009205D01*
X010434Y009205D01*
X010434Y009205D01*
Y009205D01*
X010300D01*
Y009196D01*
X010250D01*
X010236Y009193D01*
X010225Y009185D01*
X010195Y009155D01*
X010187Y009144D01*
X010184Y009130D01*
Y009100D01*
X010170D01*
Y009000D01*
Y008900D01*
X010184D01*
Y008880D01*
X010187Y008866D01*
X010195Y008855D01*
X010235Y008815D01*
X010246Y008807D01*
X010260Y008804D01*
X010300D01*
Y008795D01*
X010309D01*
Y008600D01*
X010300D01*
Y008500D01*
D01*
Y008500D01*
X010280Y008480D01*
X010250D01*
Y008340D01*
X010309D01*
Y008265D01*
X010282Y008254D01*
X010245Y008290D01*
X010215D01*
Y008200D01*
Y008110D01*
X010245D01*
X010285Y008150D01*
X010315D01*
X010355Y008110D01*
X010445D01*
X010490Y008155D01*
X010490D01*
D01*
X010510D01*
X010555Y008110D01*
X010645D01*
X010690Y008155D01*
X010690D01*
D01*
X010710D01*
X010755Y008110D01*
X010845D01*
X010890Y008155D01*
Y008245D01*
X010845Y008290D01*
X010836D01*
Y008430D01*
X010834Y008436D01*
X010857Y008456D01*
X010871Y008452D01*
X010900Y008449D01*
X010929Y008452D01*
X010958Y008461D01*
X010984Y008475D01*
X010997Y008486D01*
X011025Y008473D01*
Y008150D01*
X011024D01*
X011022Y008131D01*
X011014Y008113D01*
X011003Y008097D01*
X010987Y008086D01*
X010969Y008078D01*
X010950Y008076D01*
Y008075D01*
X010050D01*
Y008076D01*
X010031Y008078D01*
X010013Y008086D01*
X009997Y008097D01*
X009986Y008113D01*
X009978Y008131D01*
X009976Y008150D01*
X009975D01*
Y008473D01*
X010003Y008486D01*
X010016Y008475D01*
X010042Y008461D01*
X010071Y008452D01*
X010100Y008449D01*
X010129Y008452D01*
X010158Y008461D01*
X010184Y008475D01*
X010207Y008493D01*
X010225Y008516D01*
X010239Y008542D01*
X010248Y008571D01*
X010251Y008600D01*
X010248Y008629D01*
X010239Y008658D01*
X010225Y008684D01*
X010207Y008707D01*
X010184Y008725D01*
X010158Y008739D01*
X010129Y008748D01*
X010100Y008751D01*
X010071Y008748D01*
X010042Y008739D01*
X010016Y008725D01*
X010003Y008714D01*
X009975Y008727D01*
Y009273D01*
X010003Y009286D01*
X010016Y009275D01*
X010042Y009261D01*
X010071Y009252D01*
X010100Y009249D01*
X010129Y009252D01*
X010158Y009261D01*
X010184Y009275D01*
X010207Y009293D01*
X010225Y009316D01*
X010239Y009342D01*
X010248Y009371D01*
X010251Y009400D01*
X010248Y009429D01*
X010239Y009458D01*
X010225Y009484D01*
X010207Y009507D01*
X010213Y009525D01*
X010773D01*
X010786Y009497D01*
D02*
G37*
%LPC*%
G36*
X010185Y008290D02*
X010155D01*
X010110Y008245D01*
Y008215D01*
X010185D01*
Y008290D01*
D02*
G37*
G36*
Y008185D02*
X010110D01*
Y008155D01*
X010155Y008110D01*
X010185D01*
Y008185D01*
D02*
G37*
G36*
X010545Y009305D02*
X010515D01*
Y009225D01*
X010545D01*
Y009305D01*
D02*
G37*
G36*
X010485D02*
X010455D01*
Y009225D01*
X010485D01*
Y009305D01*
D02*
G37*
%LPD*%
D10*
X010790Y008950D02*
D03*
Y009050D02*
D03*
X010220D02*
D03*
Y008950D02*
D03*
D11*
X010700Y008390D02*
D03*
X010600D02*
D03*
X010450Y008550D02*
D03*
X010350D02*
D03*
D12*
X010320Y008410D02*
D03*
X010480D02*
D03*
D13*
X010500Y008790D02*
D03*
Y009210D02*
D03*
D14*
X010630Y008840D02*
D03*
Y008920D02*
D03*
Y009000D02*
D03*
Y009080D02*
D03*
Y009160D02*
D03*
X010370D02*
D03*
Y009080D02*
D03*
Y009000D02*
D03*
Y008920D02*
D03*
Y008840D02*
D03*
D15*
X010780Y008760D02*
Y008950D01*
X010730Y009000D02*
X010780Y008950D01*
X010630Y009000D02*
X010730D01*
X010860Y008840D02*
Y009000D01*
X010810Y009050D02*
X010860Y009000D01*
X010790Y009050D02*
X010810D01*
X010600Y008390D02*
Y008670D01*
X010730Y008710D02*
X010780Y008760D01*
X010730Y008500D02*
Y008710D01*
Y008500D02*
X010800Y008430D01*
Y008200D02*
Y008430D01*
X010600Y008200D02*
X010670Y008270D01*
X010260Y008840D02*
X010370D01*
X010220Y008880D02*
X010260Y008840D01*
X010220Y008880D02*
Y008950D01*
X010250Y009160D02*
X010370D01*
X010220Y009130D02*
X010250Y009160D01*
X010220Y009050D02*
Y009130D01*
X010370Y009080D02*
X010490D01*
X010500Y009070D01*
X010370Y009000D02*
X010500D01*
X010370Y008920D02*
X010490D01*
X010500Y008930D01*
Y008790D02*
Y008910D01*
Y009090D02*
Y009210D01*
X010510Y009220D01*
X010450Y009210D02*
X010500D01*
X010400Y009260D02*
X010450Y009210D01*
X010500D02*
X010556D01*
X010606Y009260D01*
X010610D01*
X010630Y008920D02*
X010710D01*
X010730Y008900D01*
X010670Y008270D02*
Y008730D01*
X010730Y008790D01*
Y008900D01*
X010490Y008920D02*
X010500Y008910D01*
X010490Y009080D02*
X010500Y009090D01*
D16*
X010480Y008380D02*
Y008410D01*
X010450Y008440D02*
X010480Y008410D01*
X010450Y008440D02*
Y008550D01*
X010530D01*
X010350Y008670D02*
X010590D01*
X010600Y008670D02*
Y008840D01*
X010590Y008670D02*
X010600D01*
X010600Y008670D01*
Y008840D02*
X010630D01*
X010350D02*
X010370D01*
X010350Y008200D02*
Y008840D01*
Y008200D02*
X010400D01*
X010500Y008300D02*
Y008390D01*
X010480Y008410D02*
X010500Y008390D01*
D17*
X010200Y008200D02*
D03*
X010400D02*
D03*
X010600D02*
D03*
X010800D02*
D03*
D18*
X010500Y009070D02*
D03*
Y008930D02*
D03*
X010530Y008550D02*
D03*
X010590Y008670D02*
D03*
X010860Y008840D02*
D03*
X010750Y009160D02*
D03*
X010610Y009260D02*
D03*
X010400D02*
D03*
X010125Y009000D02*
D03*
X010270Y008730D02*
D03*
X010970Y008130D02*
D03*
X010030D02*
D03*
Y008410D02*
D03*
X010970Y008420D02*
D03*
X010030Y008780D02*
D03*
Y009220D02*
D03*
X010970D02*
D03*
Y008780D02*
D03*
X010280Y009480D02*
D03*
X010720D02*
D03*
X010500Y008300D02*
D03*
M02*
