 0.00000000e+00 3.60000000e+01 5.40000000e+01 2.60000000e+01 5.90000000e+01 7.20000000e+01 9.00000000e+00 3.40000000e+01 7.90000000e+01 1.70000000e+01 4.60000000e+01 9.50000000e+01
 3.60000000e+01 0.00000000e+00 7.30000000e+01 3.50000000e+01 9.00000000e+01 5.80000000e+01 3.00000000e+01 7.80000000e+01 3.50000000e+01 4.40000000e+01 7.90000000e+01 3.60000000e+01
 5.40000000e+01 7.30000000e+01 0.00000000e+00 2.10000000e+01 1.00000000e+01 9.70000000e+01 5.80000000e+01 6.60000000e+01 6.90000000e+01 6.10000000e+01 5.40000000e+01 6.30000000e+01
 2.60000000e+01 3.50000000e+01 2.10000000e+01 0.00000000e+00 9.30000000e+01 1.20000000e+01 4.60000000e+01 4.00000000e+01 3.70000000e+01 4.80000000e+01 6.80000000e+01 8.50000000e+01
 5.90000000e+01 9.00000000e+01 1.00000000e+01 9.30000000e+01 0.00000000e+00 6.40000000e+01 5.00000000e+00 2.90000000e+01 7.60000000e+01 1.60000000e+01 5.00000000e+00 7.60000000e+01
 7.20000000e+01 5.80000000e+01 9.70000000e+01 1.20000000e+01 6.40000000e+01 0.00000000e+00 9.60000000e+01 5.50000000e+01 3.80000000e+01 5.40000000e+01 0.00000000e+00 3.40000000e+01
 9.00000000e+00 3.00000000e+01 5.80000000e+01 4.60000000e+01 5.00000000e+00 9.60000000e+01 0.00000000e+00 8.30000000e+01 3.50000000e+01 1.10000000e+01 5.60000000e+01 3.70000000e+01
 3.40000000e+01 7.80000000e+01 6.60000000e+01 4.00000000e+01 2.90000000e+01 5.50000000e+01 8.30000000e+01 0.00000000e+00 4.40000000e+01 1.20000000e+01 1.50000000e+01 8.00000000e+01
 7.90000000e+01 3.50000000e+01 6.90000000e+01 3.70000000e+01 7.60000000e+01 3.80000000e+01 3.50000000e+01 4.40000000e+01 0.00000000e+00 6.40000000e+01 3.90000000e+01 3.30000000e+01
 1.70000000e+01 4.40000000e+01 6.10000000e+01 4.80000000e+01 1.60000000e+01 5.40000000e+01 1.10000000e+01 1.20000000e+01 6.40000000e+01 0.00000000e+00 7.00000000e+01 8.60000000e+01
 4.60000000e+01 7.90000000e+01 5.40000000e+01 6.80000000e+01 5.00000000e+00 0.00000000e+00 5.60000000e+01 1.50000000e+01 3.90000000e+01 7.00000000e+01 0.00000000e+00 1.80000000e+01
 9.50000000e+01 3.60000000e+01 6.30000000e+01 8.50000000e+01 7.60000000e+01 3.40000000e+01 3.70000000e+01 8.00000000e+01 3.30000000e+01 8.60000000e+01 1.80000000e+01 0.00000000e+00
