{
  "name": "9x39mm Armor-Piercing Rounds",
  "type": "ammunition",
  "img": "modules/fandom-dayz/assets/ammo-9x39-ap.webp",
  "system": {
    "description": {
      "value": "9x39mm armor-piercing intermediate cartridge. Used in select rifles. — In-game description",
      "chat": "",
      "unidentified": ""
    },
    "source": "9x39mm_Armor-Piercing_Rounds",
    "tech_level": "6-8",
    "caliber": 9,
    "case_length": 39,
    "case_type": "bottlenecked",
    "rim_type": "rimless",
    "electrothermal_chemical": false
  },
  "effects": [],
  "folder": "TOxCEb2C2aDN0Yvv",
  "sort": 0,
  "ownership": {
    "default": 0
  },
  "flags": {},
  "_stats": {
    "systemId": "GDW",
    "systemVersion": "0.1.7",
    "coreVersion": "11.300",
    "createdTime": 1685914493,
    "modifiedTime": 1685914493,
    "lastModifiedBy": "DayZ-builder0000"
  },
  "_id": "ZIlzuR93pYbXDvnM"
}
