{
  "_id": "IcDlFTOfhx526RS1",
  "name": "Fragmentation Grenade",
  "type": "weapon",
  "img": "systems/ace/icons/items/weapons/grenade.webp",
  "system": {
    "description": {
      "value": "A grenade is a small explosive device designed to be thrown by hand or launched from a grenade launcher. Fragmentation grenades contain a high-explosive charge that disperses the steel fragments of the steel casing.",
      "chat": "",
      "unidentified": ""
    },
    "source": "ACE SRD v0.3, p.73",

    "cost": 180,
    "equipped": false,
    "identified": true,
    "quantity": 6,
    "tech-level": 6,
    "weight": 0.5,

    "actionType": "ranged",
    "characteristic": null,
    "damage": {
      "parts": [{
        "roll": "3d6 + @mod",
        "type": "slashing"
      }]
    },
    "exceptional": {
      "threshold": null,
      "damage": ""
    },
    "flavor": "{attacker} throws a grenade at {defender}.",
    "formula": "",

    "activation": {
      "cost": 1,
      "type": "major",
      "condition": ""
    },
    "duration": {
      "value": 0,
      "units": ""
    },
    "target": {
      "value": 6,
      "width": null,
      "units": "m",
      "type": "sphere"
    },
    "range": {
      "melee": null,
      "ranged": "thrown"
    },
    "uses": {
      "value": null,
      "max": "",
      "per": ""
    },
    "consume": {
      "type": "",
      "target": null,
      "amount": null
    },

    "armor": {
      "value": 0
    },
    "hits": {
      "value": 0,
      "max": 0,
      "dt": null,
      "conditions": ""
    },

    "law-level": 5,
    "rate-of-fire": [],
    "recoil": false,
    "weaponType": "ranged"
  },
  "effects": [],
  "folder": null,
  "sort": 0,
  "ownership": {
    "default": 0
  },
  "flags": {},
  "_stats": {
    "systemId": "ACE",
    "systemVersion": "0.4.7",
    "coreVersion": "10.291",
    "createdTime": 1670787569,
    "modifiedTime": 1670787569,
    "lastModifiedBy": "acebuilder0000"
  }
}
