{
  "_id": "YXwV09eDBfQJZvhN",
  "name": "Advocate",
  "ownership": {
    "default": 0
  },
  "type": "skill",
  "system": {
    "description": {
      "value": "<p class='p1'>The character is familiar with the general laws and regulations that govern interstellar travel, commerce and relations. This skill does not impart knowledge of the myriad of laws on each individual world, nor does it allow the person to act as an attorney.</p><p class='p1'><strong>Ship Inspections</strong>: Typically, when a ship arrives at a new world, it will be inspected by the port authorities to check for compliance with all applicable laws and regulations. It is also not uncommon for patrol ships to stop and board merchant and other ships while in deep space. When such an inspection does occur, the character may make an Advocate check (with a Difficulty based on Base Difficulty by Law Level table) to be found in compliance and pass inspection. If there is anything illegal on board, the character suffers a –2 DM to the check.</p>",
      "chat": "",
      "unidentified": ""
    },
    "source": "ACE SRD v0.3, p.43",
    "activation": {
      "type": "hour",
      "cost": 1,
      "condition": ""
    },
    "duration": {
      "value": null,
      "units": ""
    },
    "target": {
      "value": null,
      "width": null,
      "units": "",
      "type": ""
    },
    "range": {
      "value": null,
      "long": null,
      "units": ""
    },
    "uses": {
      "value": null,
      "max": "",
      "per": null,
      "recovery": ""
    },
    "consume": {
      "type": "",
      "target": null,
      "amount": null
    },
    "characteristic": "edu",
    "value": 0
  },
  "flags": {},
  "img": "icons/svg/book.svg",
  "effects": [],
  "folder": null,
  "sort": 0,
  "_stats": {
    "systemId": "ACE",
    "systemVersion": "0.4.7",
    "coreVersion": "10.291",
    "createdTime": 1670787569,
    "modifiedTime": 1670787569,
    "lastModifiedBy": "acebuilder0000"
  }
}