{
  "_id": "HNvvp2sKQ1H1MQ59",
  "name": "Admin",
  "ownership": {
    "default": 0
  },
  "type": "skill",
  "system": {
    "description": {
      "value": "<p class='p1'>The character has experience with bureaucratic agencies, and understands the requirements of dealing with and managing them. When attempting tasks like avoiding police harassment, ensuring the prompt issuance of licenses, approval of applications, avoidance of close inspection of papers, etc., a successful Admin skill check (with a Difficulty based on Base Difficulty by Law Level table), will provide a positive outcome to the situation.</p><p class='p1'><strong>Bureaucrats and Administrators</strong>: Dealing with administrators and bureaucrats is always a time consuming and tedious chore, which somehow seems to play a common part in <strong><em>Advanced Cepheus Engine</em></strong> adventures. No special skills are needed to deal with bureaucrats, but characters with the Admin (or Advocate) skill will be familiar with their ways and find the task much smoother and easier.</p><p class='p1'>The offer of a bribe and a Bribery skill check may also be attempted in place of an ability or Admin or Advocate skill check. See the Bribery skill description for more information.</p>",
      "chat": "",
      "unidentified": ""
    },
    "source": "ACE SRD v0.3, p.43",
    "activation": {
      "type": "minute",
      "cost": 5,
      "condition": ""
    },
    "duration": {
      "value": null,
      "units": ""
    },
    "target": {
      "value": null,
      "width": null,
      "units": "",
      "type": ""
    },
    "range": {
      "value": null,
      "long": null,
      "units": ""
    },
    "uses": {
      "value": null,
      "max": "",
      "per": null,
      "recovery": ""
    },
    "consume": {
      "type": "",
      "target": null,
      "amount": null
    },
    "characteristic": "edu",
    "value": 0
  },
  "flags": {},
  "img": "icons/svg/city.svg",
  "effects": [],
  "folder": null,
  "sort": 0,
  "_stats": {
    "systemId": "ACE",
    "systemVersion": "0.4.7",
    "coreVersion": "10.291",
    "createdTime": 1670787569,
    "modifiedTime": 1670787569,
    "lastModifiedBy": "acebuilder0000"
  }
}