{
  "_id": "IcDlFTOfhx526RSM",
  "name": "Body Pistol",
  "type": "weapon",
  "img": "systems/ace/icons/items/weapons/body-pistol3.webp",
  "system": {
    "description": {
      "value": "A small, non-metallic semiautomatic pistol designed to evade detection by most weapon detectors. One cartridge is fired for each pull of the trigger. Pre-loaded magazines may be inserted into the pistol when it is empty, requiring a reload action to do so. Body pistol ammunition is not interchangeable with the ammunition for any other types of guns.",
      "chat": "",
      "unidentified": ""
    },
    "source": "ACE SRD v0.2, p.85",

    "cost": 500,
    "equipped": false,
    "identified": true,
    "quantity": 1,
    "tech-level": 7,
    "weight": 0.25,

    "actionType": "ranged",
    "characteristic": null,
    "damage": {
      "parts": [{
        "roll": "2d6 + @mod",
        "type": "ballistic"
      }]
    },
    "exceptional": {
      "threshold": null,
      "damage": ""
    },
    "flavor": "{attacker} shoots at {defender} with a body-pistol.",
    "formula": "",

    "activation": {
      "cost": 1,
      "type": "major",
      "condition": ""
    },
    "duration": {
      "value": 0,
      "units": ""
    },
    "target": {
      "value": 0,
      "width": null,
      "units": "",
      "type": ""
    },
    "range": {
      "melee": null,
      "ranged": "pistol"
    },
    "uses": {
      "value": null,
      "max": "",
      "per": ""
    },
    "consume": {
      "type": "",
      "target": null,
      "amount": null
    },

    "armor": {
      "value": 0
    },
    "hits": {
      "value": 0,
      "max": 0,
      "dt": null,
      "conditions": ""
    },

    "law-level": 1,
    "rate-of-fire": [],
    "recoil": false,
    "weaponType": "ranged"
  },
  "effects": [],
  "folder": null,
  "sort": 0,
  "ownership": {
    "default": 0
  },
  "flags": {},
  "_stats": {
    "systemId": "ACE",
    "systemVersion": "0.4.7",
    "coreVersion": "10.291",
    "createdTime": 1670787569,
    "modifiedTime": 1670787569,
    "lastModifiedBy": "acebuilder0000"
  }
}
