-6.0                  -5261.960082484017
-5.878787878787879    -4851.82677909875
-5.757575757575758    -4459.236476531514
-5.636363636363637    -4083.8202026888416
-5.515151515151516    -3725.2082938518192
-5.393939393939394    -3383.0316889078736
-5.2727272727272725   -3056.920853715018
-5.151515151515151    -2746.506820248028
-5.03030303030303     -2451.4201772780284
-4.909090909090909    -2171.2914680505937
-4.787878787878788    -1905.7515184882147
-4.666666666666666    -1654.431122201988
-4.545454545454545    -1416.9609372268717
-4.424242424242424    -1192.9715724481816
-4.303030303030303    -982.0941055526514
-4.181818181818182    -783.9588062294715
-4.0606060606060606   -598.1967730086907
-3.9393939393939394   -424.43827587961954
-3.8181818181818183   -262.3141389705998
-3.696969696969697    -111.45561497860406
-3.5757575757575757   28.507509951556543
-3.4545454545454546   157.94342502785074
-3.333333333333333    277.2222486235233
-3.212121212121212    386.7130993783106
-3.090909090909091    486.7846714798639
-2.9696969696969697   577.8075328774054
-2.8484848484848486   660.1497015818055
-2.727272727272727    734.1809841487977
-2.606060606060606    800.2707520925974
-2.484848484848485    858.788326699643
-2.3636363636363633   910.1026182915074
-2.242424242424242    954.5831216422904
-2.121212121212121    992.5992517015976
-2.0                  1024.5200572658287
-1.878787878787879    1050.714880786653
-1.7575757575757578   1071.553222207748
-1.6363636363636367   1087.4043619982876
-1.5151515151515147   1098.637204382806
-1.3939393939393936   1105.621334910524
-1.2727272727272725   1108.7259487619976
-1.1515151515151514   1108.3203385907523
-1.0303030303030303   1104.7740265721475
-0.9090909090909092   1098.4560526398855
-0.7878787878787881   1089.7356755062387
-0.6666666666666661   1078.9822847263129
-0.545454545454545    1066.5649899661587
-0.42424242424242387  1052.853434282127
-0.30303030303030276  1038.2163356676078
-0.18181818181818166  1023.0237312044765
-0.06060606060606055  1007.6443130694515
0.06060606060606055   992.4475851094869
0.18181818181818166   977.8027979994619
0.30303030303030276   964.0791431145559
0.42424242424242475   951.6460643209347
0.5454545454545459    940.8731139461814
0.666666666666667     932.1288353376337
0.7878787878787881    925.7833794394801
0.9090909090909092    922.204974499641
1.0303030303030303    921.7640730732891
1.1515151515151514    924.8291103667568
1.2727272727272734    931.7697321494278
1.3939393939393945    942.9553707544688
1.5151515151515156    958.7550541549639
1.6363636363636367    979.5376263262448
1.7575757575757578    1005.673685978277
1.878787878787879     1037.5309433889906
2.0                   1075.4799025197747
2.121212121212121     1119.8893220400544
2.242424242424242     1171.1286591167266
2.3636363636363633    1229.5668373204983
2.4848484848484844    1295.5736790524784
2.6060606060606055    1369.5180366800005
2.7272727272727266    1451.7691519019972
2.8484848484848495    1542.6969833301907
2.9696969696969706    1642.6701991318148
3.0909090909090917    1752.0580344608768
3.212121212121213     1871.230066774438
3.333333333333334     2000.5556049012562
3.454545454545455     2140.403734011811
3.575757575757576     2291.143787889129
3.6969696969696972    2453.1450504537543
3.8181818181818183    2626.777122406663
3.9393939393939394    2812.4087980277745
4.0606060606060606    3010.409818895123
4.181818181818182     3221.1490568832105
4.303030303030303     3444.995650431164
4.424242424242424     3682.319762271762
4.545454545454545     3933.489869712086
4.666666666666668     4198.875611874367
4.787878787878789     4478.84615417285
4.90909090909091      4773.770638469375
5.030303030303031     5084.018755809485
5.151515151515152     5409.959386999504
5.272727272727273     5751.962265956814
5.3939393939393945    6110.396213334257
5.515151515151516     6485.630690451773
5.636363636363637     6878.034961132428
5.757575757575758     7287.978579455071
5.878787878787879     7715.83052079472
6.0                   8161.959999667418
